BDBM33695 3-[(2-chlorobenzoyl)amino]-1H-1,2,4-triazole-5-carboxylic acid methyl ester::3-[[(2-chlorophenyl)-oxomethyl]amino]-1H-1,2,4-triazole-5-carboxylic acid methyl ester::MLS000564035::SMR000151648::cid_2314691::methyl 3-[(2-chlorobenzoyl)amino]-1H-1,2,4-triazole-5-carboxylate::methyl 3-[(2-chlorophenyl)carbonylamino]-1H-1,2,4-triazole-5-carboxylate
SMILES: COC(=O)c1nnc(NC(=O)c2ccccc2Cl)[nH]1
InChI Key: InChIKey=HTNXZTLBVIXWCB-UHFFFAOYSA-N
Data: 3 IC50
Activity Spreadsheet -- Enzyme Inhibition Constant Data from BindingDB
Found 3 hits for monomerid = 33695
Trg + Lig
Ki
nM
ΔG°
kcal/mole
IC50
nM
Kd
nM
EC50/IC50
nM
koff
s-1
kon
M-1s-1
pHTemp
°C
Prothrombin
(Homo sapiens (Human))
BDBM33695
(3-[(2-chlorobenzoyl)amino]-1H-1,2,4-triazole-5-car...)
Show SMILES COC(=O)c1nnc(NC(=O)c2ccccc2Cl)[nH]1
Show InChI InChI=1S/C11H9ClN4O3/c1-19-10(18)8-13-11(16-15-8)14-9(17)6-4-2-3-5-7(6)12/h2-5H,1H3,(H2,13,14,15,16,17)
PCBioAssay
n/an/a 41.1n/an/an/an/a7.523
PCMD
Curated by PubChem BioAssay
Assay Description
HTS was performed using 217,350 compounds of the MLSCN library individually plated into 10ul 1536 compound plates at a concentration of 2.5 mM each, ...
PubChem Bioassay (2008)
BindingDB Entry DOI: 10.7270/Q2K64GDN
Kallikrein 5
(Homo sapiens (Human))
BDBM33695
(3-[(2-chlorobenzoyl)amino]-1H-1,2,4-triazole-5-car...)
Show SMILES COC(=O)c1nnc(NC(=O)c2ccccc2Cl)[nH]1
Show InChI InChI=1S/C11H9ClN4O3/c1-19-10(18)8-13-11(16-15-8)14-9(17)6-4-2-3-5-7(6)12/h2-5H,1H3,(H2,13,14,15,16,17)
PCBioAssay
n/an/a 2.94E+4n/an/an/an/an/an/a
PCMD
Curated by PubChem BioAssay
Assay Description
Molecular Library Screening Center Network (MLSCN) Penn Center for Molecular Discovery (PCMD) Assay Provider: Scott L. Diamond, University of Pennsy...
PubChem Bioassay (2008)
BindingDB Entry DOI: 10.7270/Q2GH9GC8
Factor XIIa
(Homo sapiens (Human))
BDBM33695
(3-[(2-chlorobenzoyl)amino]-1H-1,2,4-triazole-5-car...)
Show SMILES COC(=O)c1nnc(NC(=O)c2ccccc2Cl)[nH]1
Show InChI InChI=1S/C11H9ClN4O3/c1-19-10(18)8-13-11(16-15-8)14-9(17)6-4-2-3-5-7(6)12/h2-5H,1H3,(H2,13,14,15,16,17)
PCBioAssay
n/an/a 1.05E+3n/an/an/an/an/an/a
PCMD
Curated by PubChem BioAssay
Assay Description
Molecular Library Screening Center Network (MLSCN) Penn Center for Molecular Discovery (PCMD) Assay Provider: Scott L. Diamond, University of Pennsy...
PubChem Bioassay (2008)
BindingDB Entry DOI: 10.7270/Q21G0JQS