BDBM337027 US9745291, Compound 73::US9765068, Compound 73
SMILES: C[C@@H](Oc1cccc2cccnc12)C(=O)NC[C@H](O)CN1CCc2ccccc2C1
InChI Key: InChIKey=YPSQMJYWDJFOKN-UTKZUKDTSA-N
Data: 2 IC50
Activity Spreadsheet -- Enzyme Inhibition Constant Data from BindingDB
Found 2 hits for monomerid = 337027
Trg + Lig
Ki
nM
ΔG°
kcal/mole
IC50
nM
Kd
nM
EC50/IC50
nM
koff
s-1
kon
M-1s-1
pHTemp
°C
Protein arginine N-methyltransferase 5
(Homo sapiens (Human))
BDBM337027
(US9745291, Compound 73 | US9765068, Compound 73)
Show SMILES C[C@@H](Oc1cccc2cccnc12)C(=O)NC[C@H](O)CN1CCc2ccccc2C1 |r|
Show InChI InChI=1S/C24H27N3O3/c1-17(30-22-10-4-8-19-9-5-12-25-23(19)22)24(29)26-14-21(28)16-27-13-11-18-6-2-3-7-20(18)15-27/h2-10,12,17,21,28H,11,13-16H2,1H3,(H,26,29)/t17-,21+/m1/s1
US Patent
n/an/a<100n/an/an/an/an/an/a
Epizyme, Inc.
US Patent
Assay Description
Molecular Biology: Full-length human PRMT5 (NM_006109.3) transcript variant 1 clone was amplified from a fetal brain cDNA library, incorporating flan...
US Patent US9765068 (2017)
BindingDB Entry DOI: 10.7270/Q2959KN3
PRMT5/MEP50 Enzyme
(Homo sapiens (Human))
BDBM337027
(US9745291, Compound 73 | US9765068, Compound 73)
Show SMILES C[C@@H](Oc1cccc2cccnc12)C(=O)NC[C@H](O)CN1CCc2ccccc2C1 |r|
Show InChI InChI=1S/C24H27N3O3/c1-17(30-22-10-4-8-19-9-5-12-25-23(19)22)24(29)26-14-21(28)16-27-13-11-18-6-2-3-7-20(18)15-27/h2-10,12,17,21,28H,11,13-16H2,1H3,(H,26,29)/t17-,21+/m1/s1
US Patent
n/an/a<100n/an/an/an/an/an/a
Epizyme, Inc.
US Patent
Assay Description
The assays were all performed in a buffer consisting of 20 mM Bicine (pH=7.6), 1 mM TCEP, 0.005% BSG, and 0.002% Tween20, prepared on the day of use....
US Patent US9745291 (2017)
BindingDB Entry DOI: 10.7270/Q2J1058K