null
SMILES: O[C@@H](CNC(=O)COc1c(CN2CCOCC2)ccc2cccnc12)CN1CCc2ccccc2C1
InChI Key: InChIKey=IWYOGMGHJHUMGH-VWLOTQADSA-N
Activity Spreadsheet -- Enzyme Inhibition Constant Data from BindingDB
Found 2 hits for monomerid = 337048
Trg + Lig
Ki
nM
ΔG°
kcal/mole
IC50
nM
Kd
nM
EC50/IC50
nM
koff
s-1
kon
M-1s-1
pHTemp
°C
Protein arginine N-methyltransferase 5
(Homo sapiens (Human))
BDBM337048
(US9745291, Compound 94 | US9765068, Compound 94)
Show SMILES O[C@@H](CNC(=O)COc1c(CN2CCOCC2)ccc2cccnc12)CN1CCc2ccccc2C1 |r|
Show InChI InChI=1S/C28H34N4O4/c33-25(19-32-11-9-21-4-1-2-5-23(21)17-32)16-30-26(34)20-36-28-24(18-31-12-14-35-15-13-31)8-7-22-6-3-10-29-27(22)28/h1-8,10,25,33H,9,11-20H2,(H,30,34)/t25-/m0/s1
US Patent
n/an/a<100n/an/an/an/an/an/a
Epizyme, Inc.
US Patent
Assay Description
Molecular Biology: Full-length human PRMT5 (NM_006109.3) transcript variant 1 clone was amplified from a fetal brain cDNA library, incorporating flan...
US Patent US9765068 (2017)
BindingDB Entry DOI: 10.7270/Q2959KN3
Methylosome protein 50/Protein arginine N-methyltransferase 5
(Homo sapiens (Human))
BDBM337048
(US9745291, Compound 94 | US9765068, Compound 94)
Show SMILES O[C@@H](CNC(=O)COc1c(CN2CCOCC2)ccc2cccnc12)CN1CCc2ccccc2C1 |r|
Show InChI InChI=1S/C28H34N4O4/c33-25(19-32-11-9-21-4-1-2-5-23(21)17-32)16-30-26(34)20-36-28-24(18-31-12-14-35-15-13-31)8-7-22-6-3-10-29-27(22)28/h1-8,10,25,33H,9,11-20H2,(H,30,34)/t25-/m0/s1
US Patent
n/an/a<100n/an/an/an/an/an/a
Epizyme, Inc.
US Patent
Assay Description
The assays were all performed in a buffer consisting of 20 mM Bicine (pH=7.6), 1 mM TCEP, 0.005% BSG, and 0.002% Tween20, prepared on the day of use....
US Patent US9745291 (2017)
BindingDB Entry DOI: 10.7270/Q2J1058K