null
SMILES: CC(=O)Nc1cc(ccn1)-c1cnc(C)c(NS(=O)(=O)c2ccccc2)c1
InChI Key: InChIKey=WVMSDPYHMRIFJE-UHFFFAOYSA-N
Activity Spreadsheet -- Enzyme Inhibition Constant Data from BindingDB
Found 2 hits for monomerid = 337903
Trg + Lig
Ki
nM
ΔG°
kcal/mole
IC50
nM
Kd
nM
EC50/IC50
nM
koff
s-1
kon
M-1s-1
pHTemp
°C
Phosphatidylinositol 3-kinase catalytic subunit type 3
(Homo sapiens (Human))
BDBM337903
(US9751854, Compound I-84 | US9802960, Compound I-8...)
Show SMILES CC(=O)Nc1cc(ccn1)-c1cnc(C)c(NS(=O)(=O)c2ccccc2)c1
Show InChI InChI=1S/C19H18N4O3S/c1-13-18(23-27(25,26)17-6-4-3-5-7-17)10-16(12-21-13)15-8-9-20-19(11-15)22-14(2)24/h3-12,23H,1-2H3,(H,20,22,24)
Reactome pathway
US Patent
n/an/a<10n/an/an/an/an/an/a
Millennium Pharmaceuticals, Inc.
US Patent
Assay Description
100 nL compounds in DMSO are added to wells of a 384 well microtitre plate (Greiner 780076). At room temperature: 5 ul VPS34 reaction buffer (Invitro...
US Patent US9802960 (2017)
BindingDB Entry DOI: 10.7270/Q2D79DJ9
Phosphatidylinositol 3-kinase catalytic subunit type 3
(Homo sapiens (Human))
BDBM337903
(US9751854, Compound I-84 | US9802960, Compound I-8...)
Show SMILES CC(=O)Nc1cc(ccn1)-c1cnc(C)c(NS(=O)(=O)c2ccccc2)c1
Show InChI InChI=1S/C19H18N4O3S/c1-13-18(23-27(25,26)17-6-4-3-5-7-17)10-16(12-21-13)15-8-9-20-19(11-15)22-14(2)24/h3-12,23H,1-2H3,(H,20,22,24)
Reactome pathway
US Patent
n/an/a<10n/an/an/an/an/an/a
Millennium Pharmaceuticals, Inc.
US Patent
Assay Description
100 nL compounds in DMSO are added to wells of a 384 well microtitre plate (Greiner 780076). At room temperature: 5 ul VPS34 reaction buffer (Invitro...
US Patent US9751854 (2017)
BindingDB Entry DOI: 10.7270/Q2KS6TNJ