null
SMILES: CC(=O)Nc1cc(ccn1)-c1cnc(C)c(NS(=O)(=O)c2ccc(Cl)cc2F)c1
InChI Key: InChIKey=CBLNAUCFNHATHM-UHFFFAOYSA-N
Activity Spreadsheet -- Enzyme Inhibition Constant Data from BindingDB
Found 2 hits for monomerid = 337913
Trg + Lig
Ki
nM
ΔG°
kcal/mole
IC50
nM
Kd
nM
EC50/IC50
nM
koff
s-1
kon
M-1s-1
pHTemp
°C
Phosphatidylinositol 3-kinase catalytic subunit type 3
(Homo sapiens (Human))
BDBM337913
(US9751854, Compound I-94 | US9802960, Compound I-9...)
Show SMILES CC(=O)Nc1cc(ccn1)-c1cnc(C)c(NS(=O)(=O)c2ccc(Cl)cc2F)c1
Show InChI InChI=1S/C19H16ClFN4O3S/c1-11-17(25-29(27,28)18-4-3-15(20)9-16(18)21)7-14(10-23-11)13-5-6-22-19(8-13)24-12(2)26/h3-10,25H,1-2H3,(H,22,24,26)
Reactome pathway
US Patent
n/an/a<10n/an/an/an/an/an/a
Millennium Pharmaceuticals, Inc.
US Patent
Assay Description
100 nL compounds in DMSO are added to wells of a 384 well microtitre plate (Greiner 780076). At room temperature: 5 ul VPS34 reaction buffer (Invitro...
US Patent US9802960 (2017)
BindingDB Entry DOI: 10.7270/Q2D79DJ9
Phosphatidylinositol 3-kinase catalytic subunit type 3
(Homo sapiens (Human))
BDBM337913
(US9751854, Compound I-94 | US9802960, Compound I-9...)
Show SMILES CC(=O)Nc1cc(ccn1)-c1cnc(C)c(NS(=O)(=O)c2ccc(Cl)cc2F)c1
Show InChI InChI=1S/C19H16ClFN4O3S/c1-11-17(25-29(27,28)18-4-3-15(20)9-16(18)21)7-14(10-23-11)13-5-6-22-19(8-13)24-12(2)26/h3-10,25H,1-2H3,(H,22,24,26)
Reactome pathway
US Patent
n/an/a<10n/an/an/an/an/an/a
Millennium Pharmaceuticals, Inc.
US Patent
Assay Description
100 nL compounds in DMSO are added to wells of a 384 well microtitre plate (Greiner 780076). At room temperature: 5 ul VPS34 reaction buffer (Invitro...
US Patent US9751854 (2017)
BindingDB Entry DOI: 10.7270/Q2KS6TNJ