null
SMILES: COc1ncc(cc1S(=O)(=O)Nc1ccc(F)cc1F)-c1ccnc(NC(C)=O)c1
InChI Key: InChIKey=ZBVQSFTUDFTCFS-UHFFFAOYSA-N
Activity Spreadsheet -- Enzyme Inhibition Constant Data from BindingDB
Found 2 hits for monomerid = 337926
Trg + Lig
Ki
nM
ΔG°
kcal/mole
IC50
nM
Kd
nM
EC50/IC50
nM
koff
s-1
kon
M-1s-1
pHTemp
°C
Phosphatidylinositol 3-kinase catalytic subunit type 3
(Homo sapiens (Human))
BDBM337926
(US9751854, Compound I-107 | US9802960, Compound I-...)
Show SMILES COc1ncc(cc1S(=O)(=O)Nc1ccc(F)cc1F)-c1ccnc(NC(C)=O)c1
Show InChI InChI=1S/C19H16F2N4O4S/c1-11(26)24-18-8-12(5-6-22-18)13-7-17(19(29-2)23-10-13)30(27,28)25-16-4-3-14(20)9-15(16)21/h3-10,25H,1-2H3,(H,22,24,26)
Reactome pathway
US Patent
n/an/a<10n/an/an/an/an/an/a
Millennium Pharmaceuticals, Inc.
US Patent
Assay Description
100 nL compounds in DMSO are added to wells of a 384 well microtitre plate (Greiner 780076). At room temperature: 5 ul VPS34 reaction buffer (Invitro...
US Patent US9802960 (2017)
BindingDB Entry DOI: 10.7270/Q2D79DJ9
Phosphatidylinositol 3-kinase catalytic subunit type 3
(Homo sapiens (Human))
BDBM337926
(US9751854, Compound I-107 | US9802960, Compound I-...)
Show SMILES COc1ncc(cc1S(=O)(=O)Nc1ccc(F)cc1F)-c1ccnc(NC(C)=O)c1
Show InChI InChI=1S/C19H16F2N4O4S/c1-11(26)24-18-8-12(5-6-22-18)13-7-17(19(29-2)23-10-13)30(27,28)25-16-4-3-14(20)9-15(16)21/h3-10,25H,1-2H3,(H,22,24,26)
Reactome pathway
US Patent
n/an/a<10n/an/an/an/an/an/a
Millennium Pharmaceuticals, Inc.
US Patent
Assay Description
100 nL compounds in DMSO are added to wells of a 384 well microtitre plate (Greiner 780076). At room temperature: 5 ul VPS34 reaction buffer (Invitro...
US Patent US9751854 (2017)
BindingDB Entry DOI: 10.7270/Q2KS6TNJ