null
SMILES: COc1cccc(c1)S(=O)(=O)Nc1cc(cnc1C)-c1ccnc(NC(C)=O)c1
InChI Key: InChIKey=YJPZKPGERFQUJS-UHFFFAOYSA-N
Activity Spreadsheet -- Enzyme Inhibition Constant Data from BindingDB
Found 2 hits for monomerid = 337947
Trg + Lig
Ki
nM
ΔG°
kcal/mole
IC50
nM
Kd
nM
EC50/IC50
nM
koff
s-1
kon
M-1s-1
pHTemp
°C
Phosphatidylinositol 3-kinase catalytic subunit type 3
(Homo sapiens (Human))
BDBM337947
(US9751854, Compound I-123 | US9802960, Compound I-...)
Show SMILES COc1cccc(c1)S(=O)(=O)Nc1cc(cnc1C)-c1ccnc(NC(C)=O)c1
Show InChI InChI=1S/C20H20N4O4S/c1-13-19(24-29(26,27)18-6-4-5-17(11-18)28-3)9-16(12-22-13)15-7-8-21-20(10-15)23-14(2)25/h4-12,24H,1-3H3,(H,21,23,25)
Reactome pathway
US Patent
n/an/a<10n/an/an/an/an/an/a
Millennium Pharmaceuticals, Inc.
US Patent
Assay Description
100 nL compounds in DMSO are added to wells of a 384 well microtitre plate (Greiner 780076). At room temperature: 5 ul VPS34 reaction buffer (Invitro...
US Patent US9802960 (2017)
BindingDB Entry DOI: 10.7270/Q2D79DJ9
Phosphatidylinositol 3-kinase catalytic subunit type 3
(Homo sapiens (Human))
BDBM337947
(US9751854, Compound I-123 | US9802960, Compound I-...)
Show SMILES COc1cccc(c1)S(=O)(=O)Nc1cc(cnc1C)-c1ccnc(NC(C)=O)c1
Show InChI InChI=1S/C20H20N4O4S/c1-13-19(24-29(26,27)18-6-4-5-17(11-18)28-3)9-16(12-22-13)15-7-8-21-20(10-15)23-14(2)25/h4-12,24H,1-3H3,(H,21,23,25)
Reactome pathway
US Patent
n/an/a<10n/an/an/an/an/an/a
Millennium Pharmaceuticals, Inc.
US Patent
Assay Description
100 nL compounds in DMSO are added to wells of a 384 well microtitre plate (Greiner 780076). At room temperature: 5 ul VPS34 reaction buffer (Invitro...
US Patent US9751854 (2017)
BindingDB Entry DOI: 10.7270/Q2KS6TNJ