BDBM337955 US9751854, Compound I-131::US9802960, Compound I-131
SMILES: CC(=O)Nc1cc(ccn1)-c1cnc(C)c(NS(=O)(=O)c2ccc(cc2)C(C)(C)C)c1
InChI Key: InChIKey=OSFCFZONZDMVGL-UHFFFAOYSA-N
Data: 2 IC50
Activity Spreadsheet -- Enzyme Inhibition Constant Data from BindingDB
Found 2 hits for monomerid = 337955
Trg + Lig
Ki
nM
ΔG°
kcal/mole
IC50
nM
Kd
nM
EC50/IC50
nM
koff
s-1
kon
M-1s-1
pHTemp
°C
Phosphatidylinositol 3-kinase catalytic subunit type 3
(Homo sapiens (Human))
BDBM337955
(US9751854, Compound I-131 | US9802960, Compound I-...)
Show SMILES CC(=O)Nc1cc(ccn1)-c1cnc(C)c(NS(=O)(=O)c2ccc(cc2)C(C)(C)C)c1
Show InChI InChI=1S/C23H26N4O3S/c1-15-21(27-31(29,30)20-8-6-19(7-9-20)23(3,4)5)12-18(14-25-15)17-10-11-24-22(13-17)26-16(2)28/h6-14,27H,1-5H3,(H,24,26,28)
Reactome pathway
US Patent
n/an/a<10n/an/an/an/an/an/a
Millennium Pharmaceuticals, Inc.
US Patent
Assay Description
100 nL compounds in DMSO are added to wells of a 384 well microtitre plate (Greiner 780076). At room temperature: 5 ul VPS34 reaction buffer (Invitro...
US Patent US9802960 (2017)
BindingDB Entry DOI: 10.7270/Q2D79DJ9
Phosphatidylinositol 3-kinase catalytic subunit type 3
(Homo sapiens (Human))
BDBM337955
(US9751854, Compound I-131 | US9802960, Compound I-...)
Show SMILES CC(=O)Nc1cc(ccn1)-c1cnc(C)c(NS(=O)(=O)c2ccc(cc2)C(C)(C)C)c1
Show InChI InChI=1S/C23H26N4O3S/c1-15-21(27-31(29,30)20-8-6-19(7-9-20)23(3,4)5)12-18(14-25-15)17-10-11-24-22(13-17)26-16(2)28/h6-14,27H,1-5H3,(H,24,26,28)
Reactome pathway
US Patent
n/an/a<10n/an/an/an/an/an/a
Millennium Pharmaceuticals, Inc.
US Patent
Assay Description
100 nL compounds in DMSO are added to wells of a 384 well microtitre plate (Greiner 780076). At room temperature: 5 ul VPS34 reaction buffer (Invitro...
US Patent US9751854 (2017)
BindingDB Entry DOI: 10.7270/Q2KS6TNJ