null
SMILES: CC(=O)Nc1cc(ccn1)-c1cnc(N)c(c1)C(=O)Nc1ccccc1Cl
InChI Key: InChIKey=NIBCMSAQUZCNTD-UHFFFAOYSA-N
Activity Spreadsheet -- Enzyme Inhibition Constant Data from BindingDB
Found 2 hits for monomerid = 337960
Trg + Lig
Ki
nM
ΔG°
kcal/mole
IC50
nM
Kd
nM
EC50/IC50
nM
koff
s-1
kon
M-1s-1
pHTemp
°C
Phosphatidylinositol 3-kinase catalytic subunit type 3
(Homo sapiens (Human))
BDBM337960
(US9751854, Compound I-136 | US9802960, Compound I-...)
Show SMILES CC(=O)Nc1cc(ccn1)-c1cnc(N)c(c1)C(=O)Nc1ccccc1Cl
Show InChI InChI=1S/C19H16ClN5O2/c1-11(26)24-17-9-12(6-7-22-17)13-8-14(18(21)23-10-13)19(27)25-16-5-3-2-4-15(16)20/h2-10H,1H3,(H2,21,23)(H,25,27)(H,22,24,26)
Reactome pathway
US Patent
n/an/a<10n/an/an/an/an/an/a
Millennium Pharmaceuticals, Inc.
US Patent
Assay Description
100 nL compounds in DMSO are added to wells of a 384 well microtitre plate (Greiner 780076). At room temperature: 5 ul VPS34 reaction buffer (Invitro...
US Patent US9802960 (2017)
BindingDB Entry DOI: 10.7270/Q2D79DJ9
Phosphatidylinositol 3-kinase catalytic subunit type 3
(Homo sapiens (Human))
BDBM337960
(US9751854, Compound I-136 | US9802960, Compound I-...)
Show SMILES CC(=O)Nc1cc(ccn1)-c1cnc(N)c(c1)C(=O)Nc1ccccc1Cl
Show InChI InChI=1S/C19H16ClN5O2/c1-11(26)24-17-9-12(6-7-22-17)13-8-14(18(21)23-10-13)19(27)25-16-5-3-2-4-15(16)20/h2-10H,1H3,(H2,21,23)(H,25,27)(H,22,24,26)
Reactome pathway
US Patent
n/an/a<10n/an/an/an/an/an/a
Millennium Pharmaceuticals, Inc.
US Patent
Assay Description
100 nL compounds in DMSO are added to wells of a 384 well microtitre plate (Greiner 780076). At room temperature: 5 ul VPS34 reaction buffer (Invitro...
US Patent US9751854 (2017)
BindingDB Entry DOI: 10.7270/Q2KS6TNJ