BDBM337967 US9751854, Compound I-143::US9802960, Compound I-143
SMILES: CC(=O)Nc1cc(ccn1)-c1cnc(C)c(NS(=O)(=O)c2cc(ccc2F)C(F)(F)F)c1
InChI Key: InChIKey=OBJIJTGXFFPGHT-UHFFFAOYSA-N
Data: 2 IC50
Activity Spreadsheet -- Enzyme Inhibition Constant Data from BindingDB
Found 2 hits for monomerid = 337967
Trg + Lig
Ki
nM
ΔG°
kcal/mole
IC50
nM
Kd
nM
EC50/IC50
nM
koff
s-1
kon
M-1s-1
pHTemp
°C
Phosphatidylinositol 3-kinase catalytic subunit type 3
(Homo sapiens (Human))
BDBM337967
(US9751854, Compound I-143 | US9802960, Compound I-...)
Show SMILES CC(=O)Nc1cc(ccn1)-c1cnc(C)c(NS(=O)(=O)c2cc(ccc2F)C(F)(F)F)c1
Show InChI InChI=1S/C20H16F4N4O3S/c1-11-17(7-14(10-26-11)13-5-6-25-19(8-13)27-12(2)29)28-32(30,31)18-9-15(20(22,23)24)3-4-16(18)21/h3-10,28H,1-2H3,(H,25,27,29)
Reactome pathway
US Patent
n/an/a<10n/an/an/an/an/an/a
Millennium Pharmaceuticals, Inc.
US Patent
Assay Description
100 nL compounds in DMSO are added to wells of a 384 well microtitre plate (Greiner 780076). At room temperature: 5 ul VPS34 reaction buffer (Invitro...
US Patent US9802960 (2017)
BindingDB Entry DOI: 10.7270/Q2D79DJ9
Phosphatidylinositol 3-kinase catalytic subunit type 3
(Homo sapiens (Human))
BDBM337967
(US9751854, Compound I-143 | US9802960, Compound I-...)
Show SMILES CC(=O)Nc1cc(ccn1)-c1cnc(C)c(NS(=O)(=O)c2cc(ccc2F)C(F)(F)F)c1
Show InChI InChI=1S/C20H16F4N4O3S/c1-11-17(7-14(10-26-11)13-5-6-25-19(8-13)27-12(2)29)28-32(30,31)18-9-15(20(22,23)24)3-4-16(18)21/h3-10,28H,1-2H3,(H,25,27,29)
Reactome pathway
US Patent
n/an/a<10n/an/an/an/an/an/a
Millennium Pharmaceuticals, Inc.
US Patent
Assay Description
100 nL compounds in DMSO are added to wells of a 384 well microtitre plate (Greiner 780076). At room temperature: 5 ul VPS34 reaction buffer (Invitro...
US Patent US9751854 (2017)
BindingDB Entry DOI: 10.7270/Q2KS6TNJ