null
SMILES: CNc1ncc(cc1N(C)S(C)(=O)=O)-c1ccnc(NC(C)=O)c1
InChI Key: InChIKey=NJGYCVDFIFBTQK-UHFFFAOYSA-N
Activity Spreadsheet -- Enzyme Inhibition Constant Data from BindingDB
Found 2 hits for monomerid = 337971
Trg + Lig
Ki
nM
ΔG°
kcal/mole
IC50
nM
Kd
nM
EC50/IC50
nM
koff
s-1
kon
M-1s-1
pHTemp
°C
Phosphatidylinositol 3-kinase catalytic subunit type 3
(Homo sapiens (Human))
BDBM337971
(US9751854, Compound I-147 | US9802960, Compound I-...)
Show SMILES CNc1ncc(cc1N(C)S(C)(=O)=O)-c1ccnc(NC(C)=O)c1
Show InChI InChI=1S/C15H19N5O3S/c1-10(21)19-14-8-11(5-6-17-14)12-7-13(15(16-2)18-9-12)20(3)24(4,22)23/h5-9H,1-4H3,(H,16,18)(H,17,19,21)
Reactome pathway
US Patent
n/an/a<10n/an/an/an/an/an/a
Millennium Pharmaceuticals, Inc.
US Patent
Assay Description
100 nL compounds in DMSO are added to wells of a 384 well microtitre plate (Greiner 780076). At room temperature: 5 ul VPS34 reaction buffer (Invitro...
US Patent US9802960 (2017)
BindingDB Entry DOI: 10.7270/Q2D79DJ9
Phosphatidylinositol 3-kinase catalytic subunit type 3
(Homo sapiens (Human))
BDBM337971
(US9751854, Compound I-147 | US9802960, Compound I-...)
Show SMILES CNc1ncc(cc1N(C)S(C)(=O)=O)-c1ccnc(NC(C)=O)c1
Show InChI InChI=1S/C15H19N5O3S/c1-10(21)19-14-8-11(5-6-17-14)12-7-13(15(16-2)18-9-12)20(3)24(4,22)23/h5-9H,1-4H3,(H,16,18)(H,17,19,21)
Reactome pathway
US Patent
n/an/a<10n/an/an/an/an/an/a
Millennium Pharmaceuticals, Inc.
US Patent
Assay Description
100 nL compounds in DMSO are added to wells of a 384 well microtitre plate (Greiner 780076). At room temperature: 5 ul VPS34 reaction buffer (Invitro...
US Patent US9751854 (2017)
BindingDB Entry DOI: 10.7270/Q2KS6TNJ