BDBM338027 US9751854, Compound I-203::US9802960, Compound I-203
SMILES: CC(=O)Nc1cc(ccn1)-c1cnc(C)c(NS(=O)(=O)c2ccsc2)c1
InChI Key: InChIKey=UCNKMRRCKBBJCH-UHFFFAOYSA-N
Data: 2 IC50
Activity Spreadsheet -- Enzyme Inhibition Constant Data from BindingDB
Found 2 hits for monomerid = 338027
Trg + Lig
Ki
nM
ΔG°
kcal/mole
IC50
nM
Kd
nM
EC50/IC50
nM
koff
s-1
kon
M-1s-1
pHTemp
°C
Phosphatidylinositol 3-kinase catalytic subunit type 3
(Homo sapiens (Human))
BDBM338027
(US9751854, Compound I-203 | US9802960, Compound I-...)
Show SMILES CC(=O)Nc1cc(ccn1)-c1cnc(C)c(NS(=O)(=O)c2ccsc2)c1
Show InChI InChI=1S/C17H16N4O3S2/c1-11-16(21-26(23,24)15-4-6-25-10-15)7-14(9-19-11)13-3-5-18-17(8-13)20-12(2)22/h3-10,21H,1-2H3,(H,18,20,22)
Reactome pathway
US Patent
n/an/a<10n/an/an/an/an/an/a
Millennium Pharmaceuticals, Inc.
US Patent
Assay Description
100 nL compounds in DMSO are added to wells of a 384 well microtitre plate (Greiner 780076). At room temperature: 5 ul VPS34 reaction buffer (Invitro...
US Patent US9802960 (2017)
BindingDB Entry DOI: 10.7270/Q2D79DJ9
Phosphatidylinositol 3-kinase catalytic subunit type 3
(Homo sapiens (Human))
BDBM338027
(US9751854, Compound I-203 | US9802960, Compound I-...)
Show SMILES CC(=O)Nc1cc(ccn1)-c1cnc(C)c(NS(=O)(=O)c2ccsc2)c1
Show InChI InChI=1S/C17H16N4O3S2/c1-11-16(21-26(23,24)15-4-6-25-10-15)7-14(9-19-11)13-3-5-18-17(8-13)20-12(2)22/h3-10,21H,1-2H3,(H,18,20,22)
Reactome pathway
US Patent
n/an/a<10n/an/an/an/an/an/a
Millennium Pharmaceuticals, Inc.
US Patent
Assay Description
100 nL compounds in DMSO are added to wells of a 384 well microtitre plate (Greiner 780076). At room temperature: 5 ul VPS34 reaction buffer (Invitro...
US Patent US9751854 (2017)
BindingDB Entry DOI: 10.7270/Q2KS6TNJ