BDBM340084 US10239883, Example 11::US10934296, Example 11::US9758524, Example 11
SMILES: CCc1ccnc(NC(=O)c2ccc(cc2)-c2nc([C@@H]3CCCN3C(=O)\C=C\COC)n3ccnc(N)c23)c1
InChI Key: InChIKey=LNWUGMPAEUGTGI-HVPBSWBLSA-N
Data: 15 EC50
Activity Spreadsheet -- Enzyme Inhibition Constant Data from BindingDB
Found 15 hits for monomerid = 340084
Trg + Lig
Ki
nM
ΔG°
kcal/mole
IC50
nM
Kd
nM
EC50/IC50
nM
koff
s-1
kon
M-1s-1
pHTemp
°C
Tyrosine-protein kinase BTK
(Homo sapiens (Human))
BDBM340084
(US10239883, Example 11 | US10934296, Example 11 | ...)
Show SMILES CCc1ccnc(NC(=O)c2ccc(cc2)-c2nc([C@@H]3CCCN3C(=O)\C=C\COC)n3ccnc(N)c23)c1 |r|
Show InChI InChI=1S/C29H31N7O3/c1-3-19-12-13-31-23(18-19)33-29(38)21-10-8-20(9-11-21)25-26-27(30)32-14-16-36(26)28(34-25)22-6-4-15-35(22)24(37)7-5-17-39-2/h5,7-14,16,18,22H,3-4,6,15,17H2,1-2H3,(H2,30,32)(H,31,33,38)/b7-5+/t22-/m0/s1
NCI pathway
Reactome pathway
US Patent
n/an/an/an/a 505n/an/an/an/a
Merck Sharp & Dohme B.V.
US Patent
Assay Description
Btk enzyme (His-Btk (Millipore catalog #14-552), is diluted to 0.4 U/mL in KR buffer (10 mM Tris-HCl, 10 mM MgCl2, 0.01% Tween-20, 0.05% NaN3, 1 mM D...
US Patent US9758524 (2017)
BindingDB Entry DOI: 10.7270/Q2GX4DPQ
Protein cereblon/Tyrosine-protein kinase SRC
(Homo sapiens (Human))
BDBM340084
(US10239883, Example 11 | US10934296, Example 11 | ...)
Show SMILES CCc1ccnc(NC(=O)c2ccc(cc2)-c2nc([C@@H]3CCCN3C(=O)\C=C\COC)n3ccnc(N)c23)c1 |r|
Show InChI InChI=1S/C29H31N7O3/c1-3-19-12-13-31-23(18-19)33-29(38)21-10-8-20(9-11-21)25-26-27(30)32-14-16-36(26)28(34-25)22-6-4-15-35(22)24(37)7-5-17-39-2/h5,7-14,16,18,22H,3-4,6,15,17H2,1-2H3,(H2,30,32)(H,31,33,38)/b7-5+/t22-/m0/s1
US Patent
n/an/an/an/a>1.00E+3n/an/an/an/a
Merck Sharp & Dohme B.V.
US Patent
Assay Description
Src enzyme activity is measured using the IMAP (immobilized metal ion affinity-based fluorescence polarization) assay as outlined below.Src enzyme (M...
US Patent US10934296 (2021)
Proto-oncogene tyrosine-protein kinase Src
(Homo sapiens (Human))
BDBM340084
(US10239883, Example 11 | US10934296, Example 11 | ...)
Show SMILES CCc1ccnc(NC(=O)c2ccc(cc2)-c2nc([C@@H]3CCCN3C(=O)\C=C\COC)n3ccnc(N)c23)c1 |r|
Show InChI InChI=1S/C29H31N7O3/c1-3-19-12-13-31-23(18-19)33-29(38)21-10-8-20(9-11-21)25-26-27(30)32-14-16-36(26)28(34-25)22-6-4-15-35(22)24(37)7-5-17-39-2/h5,7-14,16,18,22H,3-4,6,15,17H2,1-2H3,(H2,30,32)(H,31,33,38)/b7-5+/t22-/m0/s1
US Patent
n/an/an/an/a>1.00E+3n/an/an/an/a
Merck Sharp & Dohme B.V.
US Patent
Assay Description
Src enzyme activity is measured using the IMAP (immobilized metal ion affinity-based fluorescence polarization) assay as outlined below.Src enzyme (M...
US Patent US9758524 (2017)
BindingDB Entry DOI: 10.7270/Q2GX4DPQ
Tyrosine-protein kinase Fyn
(Homo sapiens (Human))
BDBM340084
(US10239883, Example 11 | US10934296, Example 11 | ...)
Show SMILES CCc1ccnc(NC(=O)c2ccc(cc2)-c2nc([C@@H]3CCCN3C(=O)\C=C\COC)n3ccnc(N)c23)c1 |r|
Show InChI InChI=1S/C29H31N7O3/c1-3-19-12-13-31-23(18-19)33-29(38)21-10-8-20(9-11-21)25-26-27(30)32-14-16-36(26)28(34-25)22-6-4-15-35(22)24(37)7-5-17-39-2/h5,7-14,16,18,22H,3-4,6,15,17H2,1-2H3,(H2,30,32)(H,31,33,38)/b7-5+/t22-/m0/s1
US Patent
n/an/an/an/a>1.00E+3n/an/an/an/a
Merck Sharp & Dohme B.V.
US Patent
Assay Description
FynT enzyme activity is measured using the IMAP (immobilized metal ion affinity-based fluorescence polarization) assay as outlined below.FynT enzyme ...
US Patent US9758524 (2017)
BindingDB Entry DOI: 10.7270/Q2GX4DPQ
Tyrosine-protein kinase Lyn
(Homo sapiens (Human))
BDBM340084
(US10239883, Example 11 | US10934296, Example 11 | ...)
Show SMILES CCc1ccnc(NC(=O)c2ccc(cc2)-c2nc([C@@H]3CCCN3C(=O)\C=C\COC)n3ccnc(N)c23)c1 |r|
Show InChI InChI=1S/C29H31N7O3/c1-3-19-12-13-31-23(18-19)33-29(38)21-10-8-20(9-11-21)25-26-27(30)32-14-16-36(26)28(34-25)22-6-4-15-35(22)24(37)7-5-17-39-2/h5,7-14,16,18,22H,3-4,6,15,17H2,1-2H3,(H2,30,32)(H,31,33,38)/b7-5+/t22-/m0/s1
Reactome pathway
US Patent
n/an/an/an/a>1.00E+3n/an/an/an/a
Merck Sharp & Dohme B.V.
US Patent
Assay Description
Lyn enzyme activity is measured using the IMAP (immobilized metal ion affinity-based fluorescence polarization) assay as outlined below.Lyn enzyme (M...
US Patent US9758524 (2017)
BindingDB Entry DOI: 10.7270/Q2GX4DPQ
Tyrosine-protein kinase BTK
(Homo sapiens (Human))
BDBM340084
(US10239883, Example 11 | US10934296, Example 11 | ...)
Show SMILES CCc1ccnc(NC(=O)c2ccc(cc2)-c2nc([C@@H]3CCCN3C(=O)\C=C\COC)n3ccnc(N)c23)c1 |r|
Show InChI InChI=1S/C29H31N7O3/c1-3-19-12-13-31-23(18-19)33-29(38)21-10-8-20(9-11-21)25-26-27(30)32-14-16-36(26)28(34-25)22-6-4-15-35(22)24(37)7-5-17-39-2/h5,7-14,16,18,22H,3-4,6,15,17H2,1-2H3,(H2,30,32)(H,31,33,38)/b7-5+/t22-/m0/s1
NCI pathway
Reactome pathway
US Patent
n/an/an/an/a 55n/an/an/an/a
Merck Research Laboratories
Assay Description
Btk enzyme (His-Btk (Millipore catalog #14-552), is diluted to 0.4 U/mL in KR buffer (10 mM Tris-HCl, 10 mM MgCl2, 0.01% Tween-20, 0.05% NaN3, 1 mM D...
J Med Chem 48: 6169-73 (2005)
BindingDB Entry DOI: 10.7270/Q20R9RQ4
Tyrosine-protein kinase Lck
(Homo sapiens (Human))
BDBM340084
(US10239883, Example 11 | US10934296, Example 11 | ...)
Show SMILES CCc1ccnc(NC(=O)c2ccc(cc2)-c2nc([C@@H]3CCCN3C(=O)\C=C\COC)n3ccnc(N)c23)c1 |r|
Show InChI InChI=1S/C29H31N7O3/c1-3-19-12-13-31-23(18-19)33-29(38)21-10-8-20(9-11-21)25-26-27(30)32-14-16-36(26)28(34-25)22-6-4-15-35(22)24(37)7-5-17-39-2/h5,7-14,16,18,22H,3-4,6,15,17H2,1-2H3,(H2,30,32)(H,31,33,38)/b7-5+/t22-/m0/s1
US Patent
n/an/an/an/a>1.00E+3n/an/an/an/a
Merck Research Laboratories
Assay Description
Lck enzyme (Millipore catalog #14-442), is diluted to 0.4 U/mL in KR buffer (10 mM Tris-HCl, 10 mM MgCl2, 0.01% Tween-20, 0.05% NaN3, 1 mM DTT, 2 mM ...
J Med Chem 48: 6169-73 (2005)
BindingDB Entry DOI: 10.7270/Q20R9RQ4
Proto-oncogene tyrosine-protein kinase Src
(Homo sapiens (Human))
BDBM340084
(US10239883, Example 11 | US10934296, Example 11 | ...)
Show SMILES CCc1ccnc(NC(=O)c2ccc(cc2)-c2nc([C@@H]3CCCN3C(=O)\C=C\COC)n3ccnc(N)c23)c1 |r|
Show InChI InChI=1S/C29H31N7O3/c1-3-19-12-13-31-23(18-19)33-29(38)21-10-8-20(9-11-21)25-26-27(30)32-14-16-36(26)28(34-25)22-6-4-15-35(22)24(37)7-5-17-39-2/h5,7-14,16,18,22H,3-4,6,15,17H2,1-2H3,(H2,30,32)(H,31,33,38)/b7-5+/t22-/m0/s1
US Patent
n/an/an/an/a>1.00E+3n/an/an/an/a
Merck Research Laboratories
Assay Description
Src enzyme (Millipore catalog #14-326), is diluted to 0.8 U/mL in KR buffer (10 mM Tris-HCl, 10 mM MgCl2, 0.01% Tween-20, 0.05% NaN3, 1 mM DTT, 2 mM ...
J Med Chem 48: 6169-73 (2005)
BindingDB Entry DOI: 10.7270/Q20R9RQ4
Tyrosine-protein kinase Fyn
(Homo sapiens (Human))
BDBM340084
(US10239883, Example 11 | US10934296, Example 11 | ...)
Show SMILES CCc1ccnc(NC(=O)c2ccc(cc2)-c2nc([C@@H]3CCCN3C(=O)\C=C\COC)n3ccnc(N)c23)c1 |r|
Show InChI InChI=1S/C29H31N7O3/c1-3-19-12-13-31-23(18-19)33-29(38)21-10-8-20(9-11-21)25-26-27(30)32-14-16-36(26)28(34-25)22-6-4-15-35(22)24(37)7-5-17-39-2/h5,7-14,16,18,22H,3-4,6,15,17H2,1-2H3,(H2,30,32)(H,31,33,38)/b7-5+/t22-/m0/s1
US Patent
n/an/an/an/a>1.00E+3n/an/an/an/a
Merck Research Laboratories
Assay Description
FynT enzyme (Biomol catalog #SE-287), is diluted to 0.5 μg/mL in KR buffer (10 mM Tris-HCl, 10 mM MgCl2, 0.01% Tween-20, 0.05% NaN3, 1 mM DTT, 2...
J Med Chem 48: 6169-73 (2005)
BindingDB Entry DOI: 10.7270/Q20R9RQ4
Tyrosine-protein kinase Lyn
(Homo sapiens (Human))
BDBM340084
(US10239883, Example 11 | US10934296, Example 11 | ...)
Show SMILES CCc1ccnc(NC(=O)c2ccc(cc2)-c2nc([C@@H]3CCCN3C(=O)\C=C\COC)n3ccnc(N)c23)c1 |r|
Show InChI InChI=1S/C29H31N7O3/c1-3-19-12-13-31-23(18-19)33-29(38)21-10-8-20(9-11-21)25-26-27(30)32-14-16-36(26)28(34-25)22-6-4-15-35(22)24(37)7-5-17-39-2/h5,7-14,16,18,22H,3-4,6,15,17H2,1-2H3,(H2,30,32)(H,31,33,38)/b7-5+/t22-/m0/s1
Reactome pathway
US Patent
n/an/an/an/a>1.00E+3n/an/an/an/a
Merck Research Laboratories
Assay Description
Lyn enzyme (Millipore catalog #14-510), is diluted to 250 mU/mL in KR buffer (10 mM Tris-HCl, 10 mM MgCl2, 0.01% Tween-20, 0.05% NaN3, 1 mM DTT, 2 mM...
J Med Chem 48: 6169-73 (2005)
BindingDB Entry DOI: 10.7270/Q20R9RQ4
Tyrosine-protein kinase Fyn
(Homo sapiens (Human))
BDBM340084
(US10239883, Example 11 | US10934296, Example 11 | ...)
Show SMILES CCc1ccnc(NC(=O)c2ccc(cc2)-c2nc([C@@H]3CCCN3C(=O)\C=C\COC)n3ccnc(N)c23)c1 |r|
Show InChI InChI=1S/C29H31N7O3/c1-3-19-12-13-31-23(18-19)33-29(38)21-10-8-20(9-11-21)25-26-27(30)32-14-16-36(26)28(34-25)22-6-4-15-35(22)24(37)7-5-17-39-2/h5,7-14,16,18,22H,3-4,6,15,17H2,1-2H3,(H2,30,32)(H,31,33,38)/b7-5+/t22-/m0/s1
US Patent
n/an/an/an/a>1.00E+3n/an/an/an/a
Merck Sharp & Dohme B.V.
US Patent
Assay Description
FynT enzyme activity is measured using the IMAP (immobilized metal ion affinity-based fluorescence polarization) assay as outlined below.FynT enzyme ...
US Patent US10934296 (2021)
Tyrosine-protein kinase Lyn
(Homo sapiens (Human))
BDBM340084
(US10239883, Example 11 | US10934296, Example 11 | ...)
Show SMILES CCc1ccnc(NC(=O)c2ccc(cc2)-c2nc([C@@H]3CCCN3C(=O)\C=C\COC)n3ccnc(N)c23)c1 |r|
Show InChI InChI=1S/C29H31N7O3/c1-3-19-12-13-31-23(18-19)33-29(38)21-10-8-20(9-11-21)25-26-27(30)32-14-16-36(26)28(34-25)22-6-4-15-35(22)24(37)7-5-17-39-2/h5,7-14,16,18,22H,3-4,6,15,17H2,1-2H3,(H2,30,32)(H,31,33,38)/b7-5+/t22-/m0/s1
Reactome pathway
US Patent
n/an/an/an/a>1.00E+3n/an/an/an/a
Merck Sharp & Dohme B.V.
US Patent
Assay Description
Lyn enzyme activity is measured using the IMAP (immobilized metal ion affinity-based fluorescence polarization) assay as outlined below.Lyn enzyme (M...
US Patent US10934296 (2021)
Tyrosine-protein kinase BTK
(Homo sapiens (Human))
BDBM340084
(US10239883, Example 11 | US10934296, Example 11 | ...)
Show SMILES CCc1ccnc(NC(=O)c2ccc(cc2)-c2nc([C@@H]3CCCN3C(=O)\C=C\COC)n3ccnc(N)c23)c1 |r|
Show InChI InChI=1S/C29H31N7O3/c1-3-19-12-13-31-23(18-19)33-29(38)21-10-8-20(9-11-21)25-26-27(30)32-14-16-36(26)28(34-25)22-6-4-15-35(22)24(37)7-5-17-39-2/h5,7-14,16,18,22H,3-4,6,15,17H2,1-2H3,(H2,30,32)(H,31,33,38)/b7-5+/t22-/m0/s1
NCI pathway
Reactome pathway
US Patent
n/an/an/an/a 55n/an/an/an/a
Merck Sharp & Dohme B.V.
US Patent
Assay Description
Btk enzyme activity is measured using the IMAP (immobilized metal ion affinity-based fluorescence polarization) assay as outlined below.Btk enzyme (H...
US Patent US10934296 (2021)
Tyrosine-protein kinase Lck
(Homo sapiens (Human))
BDBM340084
(US10239883, Example 11 | US10934296, Example 11 | ...)
Show SMILES CCc1ccnc(NC(=O)c2ccc(cc2)-c2nc([C@@H]3CCCN3C(=O)\C=C\COC)n3ccnc(N)c23)c1 |r|
Show InChI InChI=1S/C29H31N7O3/c1-3-19-12-13-31-23(18-19)33-29(38)21-10-8-20(9-11-21)25-26-27(30)32-14-16-36(26)28(34-25)22-6-4-15-35(22)24(37)7-5-17-39-2/h5,7-14,16,18,22H,3-4,6,15,17H2,1-2H3,(H2,30,32)(H,31,33,38)/b7-5+/t22-/m0/s1
US Patent
n/an/an/an/a>1.00E+3n/an/an/an/a
Merck Sharp & Dohme B.V.
US Patent
Assay Description
Lck enzyme activity is measured using the IMAP (immobilized metal ion affinity-based fluorescence polarization) assay as outlined below.Lck enzyme (M...
US Patent US10934296 (2021)
Tyrosine-protein kinase Lck
(Homo sapiens (Human))
BDBM340084
(US10239883, Example 11 | US10934296, Example 11 | ...)
Show SMILES CCc1ccnc(NC(=O)c2ccc(cc2)-c2nc([C@@H]3CCCN3C(=O)\C=C\COC)n3ccnc(N)c23)c1 |r|
Show InChI InChI=1S/C29H31N7O3/c1-3-19-12-13-31-23(18-19)33-29(38)21-10-8-20(9-11-21)25-26-27(30)32-14-16-36(26)28(34-25)22-6-4-15-35(22)24(37)7-5-17-39-2/h5,7-14,16,18,22H,3-4,6,15,17H2,1-2H3,(H2,30,32)(H,31,33,38)/b7-5+/t22-/m0/s1
US Patent
n/an/an/an/a>1.00E+3n/an/an/an/a
Merck Sharp & Dohme B.V.
US Patent
Assay Description
Lck enzyme activity is measured using the IMAP (immobilized metal ion affinity-based fluorescence polarization) assay as outlined below.Lck enzyme (M...
US Patent US9758524 (2017)
BindingDB Entry DOI: 10.7270/Q2GX4DPQ