null
SMILES: Cc1nc2c(I)c(I)c(I)c(I)c2[nH]1
InChI Key: InChIKey=PGYWHXJMGURDQZ-UHFFFAOYSA-N
Activity Spreadsheet -- Enzyme Inhibition Constant Data from BindingDB
Found 1 hit for monomerid = 34044
Trg + Lig
Ki
nM
ΔG°
kcal/mole
IC50
nM
Kd
nM
EC50/IC50
nM
koff
s-1
kon
M-1s-1
pHTemp
°C
Casein kinase II subunit alpha
(Rattus norvegicus (Rat))
BDBM34044
(iodinated benzimidazole, 7a)
Show SMILES Cc1nc2c(I)c(I)c(I)c(I)c2[nH]1
Show InChI InChI=1S/C8H4I4N2/c1-2-13-7-5(11)3(9)4(10)6(12)8(7)14-2/h1H3,(H,13,14)
Reactome pathway
24 -10.8n/an/an/an/an/a7.537
University of Padova
Assay Description
Inhibitory effect of test compound was assessed in reaction buffer containing purified CK2, synthetic peptide substrate, and [gamma-33P]ATP. Assays w...
Bioorg Med Chem 17: 7281-9 (2009)
Article DOI: 10.1016/j.bmc.2009.08.047
BindingDB Entry DOI: 10.7270/Q2NZ860P