BDBM34049 iodinated benzimidazole, 12a
SMILES: Clc1nc2c(I)c(I)c(I)c(I)c2[nH]1
InChI Key: InChIKey=XVSRSKRBVNVAQG-UHFFFAOYSA-N
Data: 1 KI
Activity Spreadsheet -- Enzyme Inhibition Constant Data from BindingDB
Found 1 hit for monomerid = 34049
Trg + Lig
Ki
nM
ΔG°
kcal/mole
IC50
nM
Kd
nM
EC50/IC50
nM
koff
s-1
kon
M-1s-1
pHTemp
°C
Casein kinase II subunit alpha
(Rattus norvegicus (Rat))
BDBM34049
(iodinated benzimidazole, 12a)
Show SMILES Clc1nc2c(I)c(I)c(I)c(I)c2[nH]1
Show InChI InChI=1S/C7HClI4N2/c8-7-13-5-3(11)1(9)2(10)4(12)6(5)14-7/h(H,13,14)
Reactome pathway
120 -9.81n/an/an/an/an/a7.537
University of Padova
Assay Description
Inhibitory effect of test compound was assessed in reaction buffer containing purified CK2, synthetic peptide substrate, and [gamma-33P]ATP. Assays w...
Bioorg Med Chem 17: 7281-9 (2009)
Article DOI: 10.1016/j.bmc.2009.08.047
BindingDB Entry DOI: 10.7270/Q2NZ860P