BDBM340528 1-(1-cyclopropyl-3-((3-(1-methyl-1H-pyrazol-4-yl)phenyl)amino)-6,7-dihydro-1H-pyrazolo[4,3-c]pyridin-5(4H)-yl)ethanone::US9763922, Example 59
SMILES: CC(=O)N1CCc2c(C1)c(Nc1cccc(c1)-c1cnn(C)c1)nn2C1CC1
InChI Key: InChIKey=HGWOEBDMGLIXHR-UHFFFAOYSA-N
Data: 2 IC50
Activity Spreadsheet -- Enzyme Inhibition Constant Data from BindingDB
Found 2 hits for monomerid = 340528
Trg + Lig
Ki
nM
ΔG°
kcal/mole
IC50
nM
Kd
nM
EC50/IC50
nM
koff
s-1
kon
M-1s-1
pHTemp
°C
Bromodomain-containing protein 4
(Homo sapiens (Human))
BDBM340528
(1-(1-cyclopropyl-3-((3-(1-methyl-1H-pyrazol-4-yl)p...)
Show SMILES CC(=O)N1CCc2c(C1)c(Nc1cccc(c1)-c1cnn(C)c1)nn2C1CC1
Show InChI InChI=1S/C21H24N6O/c1-14(28)26-9-8-20-19(13-26)21(24-27(20)18-6-7-18)23-17-5-3-4-15(10-17)16-11-22-25(2)12-16/h3-5,10-12,18H,6-9,13H2,1-2H3,(H,23,24)
US Patent
n/an/a 1.69E+3n/an/an/an/an/an/a
GENENTECH, INC.; CONSTELLATION PHARMACEUTICALS, INC.
US Patent
Assay Description
His/Flag epitope tagged BRD4 BD142-168 was cloned, expressed, and purified to. BRD4 binding and inhibition was assessed by monitoring the engagement ...
US Patent US9763922 (2017)
BindingDB Entry DOI: 10.7270/Q23N25G6
CREB-binding protein
(Homo sapiens (Human))
BDBM340528
(1-(1-cyclopropyl-3-((3-(1-methyl-1H-pyrazol-4-yl)p...)
Show SMILES CC(=O)N1CCc2c(C1)c(Nc1cccc(c1)-c1cnn(C)c1)nn2C1CC1
Show InChI InChI=1S/C21H24N6O/c1-14(28)26-9-8-20-19(13-26)21(24-27(20)18-6-7-18)23-17-5-3-4-15(10-17)16-11-22-25(2)12-16/h3-5,10-12,18H,6-9,13H2,1-2H3,(H,23,24)
Reactome pathway
US Patent
n/an/a 10n/an/an/an/an/an/a
GENENTECH, INC.; CONSTELLATION PHARMACEUTICALS, INC.
US Patent
Assay Description
His/Flag epitope tagged CBP was cloned, expressed, and purified to homogeneity. CBP binding and inhibition was assessed by monitoring the engagement ...
US Patent US9763922 (2017)
BindingDB Entry DOI: 10.7270/Q23N25G6