BDBM340734 3-[5-(difluoromethyl)-2-fluoro-4-(1-methylpyrazol-4-yl)anilino]-N-methyl-1-tetrahydropyran-4-yl-6,7-dihydro-4H-pyrazolo[4,3-c]pyridine-5-carboxamide::US9763922, Example 260
SMILES: CNC(=O)N1CCc2c(C1)c(Nc1cc(C(F)F)c(cc1F)-c1cnn(C)c1)nn2C1CCOCC1
InChI Key: InChIKey=YGEDPMXOZSQPSI-UHFFFAOYSA-N
Data: 2 IC50
Activity Spreadsheet -- Enzyme Inhibition Constant Data from BindingDB
Found 2 hits for monomerid = 340734
Trg + Lig
Ki
nM
ΔG°
kcal/mole
IC50
nM
Kd
nM
EC50/IC50
nM
koff
s-1
kon
M-1s-1
pHTemp
°C
Bromodomain-containing protein 4
(Homo sapiens (Human))
BDBM340734
(3-[5-(difluoromethyl)-2-fluoro-4-(1-methylpyrazol-...)
Show SMILES CNC(=O)N1CCc2c(C1)c(Nc1cc(C(F)F)c(cc1F)-c1cnn(C)c1)nn2C1CCOCC1
Show InChI InChI=1S/C24H28F3N7O2/c1-28-24(35)33-6-3-21-18(13-33)23(31-34(21)15-4-7-36-8-5-15)30-20-10-17(22(26)27)16(9-19(20)25)14-11-29-32(2)12-14/h9-12,15,22H,3-8,13H2,1-2H3,(H,28,35)(H,30,31)
US Patent
n/an/a 1.17E+4n/an/an/an/an/an/a
GENENTECH, INC.; CONSTELLATION PHARMACEUTICALS, INC.
US Patent
Assay Description
His/Flag epitope tagged BRD4 BD142-168 was cloned, expressed, and purified to. BRD4 binding and inhibition was assessed by monitoring the engagement ...
US Patent US9763922 (2017)
BindingDB Entry DOI: 10.7270/Q23N25G6
CREB-binding protein
(Homo sapiens (Human))
BDBM340734
(3-[5-(difluoromethyl)-2-fluoro-4-(1-methylpyrazol-...)
Show SMILES CNC(=O)N1CCc2c(C1)c(Nc1cc(C(F)F)c(cc1F)-c1cnn(C)c1)nn2C1CCOCC1
Show InChI InChI=1S/C24H28F3N7O2/c1-28-24(35)33-6-3-21-18(13-33)23(31-34(21)15-4-7-36-8-5-15)30-20-10-17(22(26)27)16(9-19(20)25)14-11-29-32(2)12-14/h9-12,15,22H,3-8,13H2,1-2H3,(H,28,35)(H,30,31)
Reactome pathway
US Patent
n/an/a 1n/an/an/an/an/an/a
GENENTECH, INC.; CONSTELLATION PHARMACEUTICALS, INC.
US Patent
Assay Description
His/Flag epitope tagged CBP was cloned, expressed, and purified to homogeneity. CBP binding and inhibition was assessed by monitoring the engagement ...
US Patent US9763922 (2017)
BindingDB Entry DOI: 10.7270/Q23N25G6