BDBM341221 (S)-2,4-diamino-6-((1-(5-(3-(4,4-difluoropiperidin-1-yl)propyl)-4-oxo-3-phenyl-3,4-dihydroquinazolin-2-yl)ethyl)amino)pyrimidine-5-carbonitrile ::US9765060, Compound 48
SMILES: C[C@H](Nc1nc(N)nc(N)c1C#N)c1nc2cccc(CCCN3CCC(F)(F)CC3)c2c(=O)n1-c1ccccc1
InChI Key: InChIKey=ARJICZONPWDDOJ-SFHVURJKSA-N
Data: 1 IC50
Activity Spreadsheet -- Enzyme Inhibition Constant Data from BindingDB
Found 1 hit for monomerid = 341221
Trg + Lig
Ki
nM
ΔG°
kcal/mole
IC50
nM
Kd
nM
EC50/IC50
nM
koff
s-1
kon
M-1s-1
pHTemp
°C
Phosphatidylinositol 4,5-bisphosphate 3-kinase catalytic subunit delta isoform
(Homo sapiens (Human))
BDBM341221
((S)-2,4-diamino-6-((1-(5-(3-(4,4-difluoropiperidin...)
Show SMILES C[C@H](Nc1nc(N)nc(N)c1C#N)c1nc2cccc(CCCN3CCC(F)(F)CC3)c2c(=O)n1-c1ccccc1
Show InChI InChI=1S/C29H31F2N9O/c1-18(35-25-21(17-32)24(33)37-28(34)38-25)26-36-22-11-5-7-19(8-6-14-39-15-12-29(30,31)13-16-39)23(22)27(41)40(26)20-9-3-2-4-10-20/h2-5,7,9-11,18H,6,8,12-16H2,1H3,(H5,33,34,35,37,38)/t18-/m0/s1
NCI pathway
Reactome pathway
US Patent
n/an/a 0.5n/an/an/an/an/an/a
GILEAD SCIENCES, INC.
US Patent
Assay Description
TR-FRET monitored the formation of 3,4,5-inositol triphosphate molecule that competed with fluorescently labeled PIP3 for binding to the GRP-1 plecks...
US Patent US9765060 (2017)
BindingDB Entry DOI: 10.7270/Q2DZ0BDH