BDBM341270 (S)-2-(1-((2-amino-5-iodo-6-methylpyrimidin-4-yl)amino)ethyl)-5-chloro-3-phenylquinazolin-4(3H)-one ::US9765060, Compound 97
SMILES: C[C@H](Nc1nc(N)nc(C)c1I)c1nc2cccc(Cl)c2c(=O)n1-c1ccccc1
InChI Key: InChIKey=TXJHXFSNTZWCEU-LBPRGKRZSA-N
Data: 1 IC50
Activity Spreadsheet -- Enzyme Inhibition Constant Data from BindingDB
Found 1 hit for monomerid = 341270
Trg + Lig
Ki
nM
ΔG°
kcal/mole
IC50
nM
Kd
nM
EC50/IC50
nM
koff
s-1
kon
M-1s-1
pHTemp
°C
Phosphatidylinositol 4,5-bisphosphate 3-kinase catalytic subunit delta isoform
(Homo sapiens (Human))
BDBM341270
((S)-2-(1-((2-amino-5-iodo-6-methylpyrimidin-4-yl)a...)
Show SMILES C[C@H](Nc1nc(N)nc(C)c1I)c1nc2cccc(Cl)c2c(=O)n1-c1ccccc1
Show InChI InChI=1S/C21H18ClIN6O/c1-11-17(23)18(28-21(24)26-11)25-12(2)19-27-15-10-6-9-14(22)16(15)20(30)29(19)13-7-4-3-5-8-13/h3-10,12H,1-2H3,(H3,24,25,26,28)/t12-/m0/s1
NCI pathway
Reactome pathway
US Patent
n/an/a 0.600n/an/an/an/an/an/a
GILEAD SCIENCES, INC.
US Patent
Assay Description
TR-FRET monitored the formation of 3,4,5-inositol triphosphate molecule that competed with fluorescently labeled PIP3 for binding to the GRP-1 plecks...
US Patent US9765060 (2017)
BindingDB Entry DOI: 10.7270/Q2DZ0BDH