BDBM341423 2-((2-chloro-6-morpholinopyridin-3-yl)oxy)-1-(5-(5-cyclopropyl-3-fluoropyridin-2-yl)-2-methyl-7,8-dihydro-[1,3,4]thiadiazolo[2',3':2,3]imidazo[4,5-c]pyridin-6(5H)-yl)ethanone::US9765092, Example 1.14.1
SMILES: Cc1nn2c3C(N(CCc3nc2s1)C(=O)COc1ccc(nc1Cl)N1CCOCC1)c1ncc(cc1F)C1CC1
InChI Key: InChIKey=NKGXJARNHDUXPV-UHFFFAOYSA-N
Data: 1 IC50
Activity Spreadsheet -- Enzyme Inhibition Constant Data from BindingDB
Found 1 hit for monomerid = 341423
Trg + Lig
Ki
nM
ΔG°
kcal/mole
IC50
nM
Kd
nM
EC50/IC50
nM
koff
s-1
kon
M-1s-1
pHTemp
°C
Tryptophan 5-hydroxylase 1
(Homo sapiens (Human))
BDBM341423
(2-((2-chloro-6-morpholinopyridin-3-yl)oxy)-1-(5-(5...)
Show SMILES Cc1nn2c3C(N(CCc3nc2s1)C(=O)COc1ccc(nc1Cl)N1CCOCC1)c1ncc(cc1F)C1CC1
Show InChI InChI=1S/C27H27ClFN7O3S/c1-15-33-36-24-19(31-27(36)40-15)6-7-35(25(24)23-18(29)12-17(13-30-23)16-2-3-16)22(37)14-39-20-4-5-21(32-26(20)28)34-8-10-38-11-9-34/h4-5,12-13,16,25H,2-3,6-11,14H2,1H3
Reactome pathway
US Patent
n/an/a 4n/an/an/an/an/an/a
ACTELION PHARMACEUTICALS LTD
US Patent
Assay Description
To generate the enzyme, full length human TPH1 is cloned into the plasmid pET20b(+) (Novagen) and expressed in E. coli. The bacterial cells are ruptu...
US Patent US9765092 (2017)
BindingDB Entry DOI: 10.7270/Q21N838B