BDBM34150 4-(3-methyl-1H-indole-1-sulfonyl)aniline, 8::CHEMBL328816::N-arenesulfonylindole antagonist, 9
SMILES: Cc1cn(c2ccccc12)S(=O)(=O)c1ccc(N)cc1
InChI Key: InChIKey=ZNRJXSHXWJKTGJ-UHFFFAOYSA-N
Data: 6 KI  1 IC50  1 EC50
Activity Spreadsheet -- Enzyme Inhibition Constant Data from BindingDB
Found 7 hits for monomerid = 34150
Trg + Lig
Ki
nM
ΔG°
kcal/mole
IC50
nM
Kd
nM
EC50/IC50
nM
koff
s-1
kon
M-1s-1
pHTemp
°C
5-hydroxytryptamine receptor 6
(Homo sapiens (Human))
BDBM34150
(4-(3-methyl-1H-indole-1-sulfonyl)aniline, 8 | CHEM...)
Show SMILES Cc1cn(c2ccccc12)S(=O)(=O)c1ccc(N)cc1
Show InChI InChI=1S/C15H14N2O2S/c1-11-10-17(15-5-3-2-4-14(11)15)20(18,19)13-8-6-12(16)7-9-13/h2-10H,16H2,1H3
Reactome pathway
12 -11.2n/an/a 320n/an/a7.437
Universitat de Barcelona
Assay Description
Radioligand binding assays were performed using membranes from HEK-293 transfected with human 5-HT6 receptor. In these membranes the receptor concent...
Bioorg Med Chem 17: 7387-97 (2009)
Article DOI: 10.1016/j.bmc.2009.08.006
BindingDB Entry DOI: 10.7270/Q2RR1WKS
5-hydroxytryptamine receptor 6
(Homo sapiens (Human))
BDBM34150
(4-(3-methyl-1H-indole-1-sulfonyl)aniline, 8 | CHEM...)
Show SMILES Cc1cn(c2ccccc12)S(=O)(=O)c1ccc(N)cc1
Show InChI InChI=1S/C15H14N2O2S/c1-11-10-17(15-5-3-2-4-14(11)15)20(18,19)13-8-6-12(16)7-9-13/h2-10H,16H2,1H3
Reactome pathway
12n/an/an/an/an/an/a7.4n/a
Virginia Commonwealth University
Assay Description
The h5-HT6 radioligand binding assays were performed as previously described. In brief, h5-HT6 cDNA was transiently expressed in HEK-293 cells using...
Medicinal Chemistry Research 14: 1-18 (2005)
BindingDB Entry DOI: 10.7270/Q2NG4P78
5-hydroxytryptamine receptor 6
(Homo sapiens (Human))
BDBM34150
(4-(3-methyl-1H-indole-1-sulfonyl)aniline, 8 | CHEM...)
Show SMILES Cc1cn(c2ccccc12)S(=O)(=O)c1ccc(N)cc1
Show InChI InChI=1S/C15H14N2O2S/c1-11-10-17(15-5-3-2-4-14(11)15)20(18,19)13-8-6-12(16)7-9-13/h2-10H,16H2,1H3
Reactome pathway
12n/an/an/an/an/an/an/an/a
Virginia Commonwealth University
Curated by ChEMBL
Assay Description
Binding affinity against 5 Hydroxy tryptamine 6 receptor
Bioorg Med Chem Lett 15: 1707-11 (2005)
Article DOI: 10.1016/j.bmcl.2005.01.031
BindingDB Entry DOI: 10.7270/Q2D21ZBG
5-hydroxytryptamine receptor 6
(Homo sapiens (Human))
BDBM34150
(4-(3-methyl-1H-indole-1-sulfonyl)aniline, 8 | CHEM...)
Show SMILES Cc1cn(c2ccccc12)S(=O)(=O)c1ccc(N)cc1
Show InChI InChI=1S/C15H14N2O2S/c1-11-10-17(15-5-3-2-4-14(11)15)20(18,19)13-8-6-12(16)7-9-13/h2-10H,16H2,1H3
Reactome pathway
12n/an/an/an/an/an/an/an/a
Virginia Commonwealth University
Curated by ChEMBL
Assay Description
Binding affinity towards human 5-hydroxytryptamine 6 receptor
Bioorg Med Chem Lett 13: 3355-9 (2003)
BindingDB Entry DOI: 10.7270/Q2DN44GB
5-hydroxytryptamine receptor 6
(Homo sapiens (Human))
BDBM34150
(4-(3-methyl-1H-indole-1-sulfonyl)aniline, 8 | CHEM...)
Show SMILES Cc1cn(c2ccccc12)S(=O)(=O)c1ccc(N)cc1
Show InChI InChI=1S/C15H14N2O2S/c1-11-10-17(15-5-3-2-4-14(11)15)20(18,19)13-8-6-12(16)7-9-13/h2-10H,16H2,1H3
Reactome pathway
12n/an/an/an/an/an/an/an/a
Virginia Commonwealth University
Curated by ChEMBL
Assay Description
Binding affinity towards human 5-hydroxytryptamine 6 receptor
J Med Chem 46: 2795-812 (2003)
Article DOI: 10.1021/jm030030n
BindingDB Entry DOI: 10.7270/Q2M0465F
5-hydroxytryptamine receptor 6
(Homo sapiens (Human))
BDBM34150
(4-(3-methyl-1H-indole-1-sulfonyl)aniline, 8 | CHEM...)
Show SMILES Cc1cn(c2ccccc12)S(=O)(=O)c1ccc(N)cc1
Show InChI InChI=1S/C15H14N2O2S/c1-11-10-17(15-5-3-2-4-14(11)15)20(18,19)13-8-6-12(16)7-9-13/h2-10H,16H2,1H3
Reactome pathway
13n/an/an/an/an/an/an/an/a
Universidad Complutense
Curated by ChEMBL
Assay Description
Binding affinity for human 5-hydroxytryptamine 6 receptor
J Med Chem 48: 4216-9 (2005)
Checked by Author
Article DOI: 10.1021/jm050247c
BindingDB Entry DOI: 10.7270/Q2736SD0
5-hydroxytryptamine receptor 6
(Homo sapiens (Human))
BDBM34150
(4-(3-methyl-1H-indole-1-sulfonyl)aniline, 8 | CHEM...)
Show SMILES Cc1cn(c2ccccc12)S(=O)(=O)c1ccc(N)cc1
Show InChI InChI=1S/C15H14N2O2S/c1-11-10-17(15-5-3-2-4-14(11)15)20(18,19)13-8-6-12(16)7-9-13/h2-10H,16H2,1H3
Reactome pathway
n/an/a 300n/an/an/an/an/an/a
Virginia Commonwealth University
Curated by ChEMBL
Assay Description
Antagonistic activity towards 5-hydroxytryptamine 6 receptor was evaluated in cAMP assay
J Med Chem 46: 2795-812 (2003)
Article DOI: 10.1021/jm030030n
BindingDB Entry DOI: 10.7270/Q2M0465F