null
SMILES: CN1CCCC(C1)C1=C(C)Cc2ccc(NS(=O)(=O)c3c(Cl)nc4sccn34)cc12
InChI Key: InChIKey=QIPQTFPYMICAEG-UHFFFAOYSA-N
Activity Spreadsheet -- Enzyme Inhibition Constant Data from BindingDB
Found 1 hit for monomerid = 34158
Trg + Lig
Ki
nM
ΔG°
kcal/mole
IC50
nM
Kd
nM
EC50/IC50
nM
koff
s-1
kon
M-1s-1
pHTemp
°C
5-hydroxytryptamine receptor 6
(Homo sapiens (Human))
BDBM34158
(indenylsulfonamide, 30)
Show SMILES CN1CCCC(C1)C1=C(C)Cc2ccc(NS(=O)(=O)c3c(Cl)nc4sccn34)cc12 |c:8|
Show InChI InChI=1S/C21H23ClN4O2S2/c1-13-10-14-5-6-16(11-17(14)18(13)15-4-3-7-25(2)12-15)24-30(27,28)20-19(22)23-21-26(20)8-9-29-21/h5-6,8-9,11,15,24H,3-4,7,10,12H2,1-2H3
Reactome pathway
18 -11.0n/an/an/an/an/a7.437
Universitat de Barcelona
Assay Description
Radioligand binding assays were performed using membranes from HEK-293 transfected with human 5-HT6 receptor. In these membranes the receptor concent...
Bioorg Med Chem 17: 7387-97 (2009)
Article DOI: 10.1016/j.bmc.2009.08.006
BindingDB Entry DOI: 10.7270/Q2RR1WKS