BDBM34160 indenylsulfonamide, 49+50::isomeric mixture (70% 7-indenyl, 30% 4-indenyl)
SMILES: CC1=Cc2cccc(NS(=O)(=O)c3c(Cl)nc4sccn34)c2C1
InChI Key: InChIKey=JDBOIELUYFBAIE-UHFFFAOYSA-N
Data: 1 Other
Activity Spreadsheet -- Enzyme Inhibition Constant Data from BindingDB
Found 1 hit for monomerid = 34160
Trg + Lig
Ki
nM
ΔG°
kcal/mole
IC50
nM
Kd
nM
EC50/IC50
nM
koff
s-1
kon
M-1s-1
pHTemp
°C
5-hydroxytryptamine receptor 6
(Homo sapiens (Human))
BDBM34160
(indenylsulfonamide, 49+50 | isomeric mixture (70% ...)
Show SMILES CC1=Cc2cccc(NS(=O)(=O)c3c(Cl)nc4sccn34)c2C1 |t:1|
Show InChI InChI=1S/C15H12ClN3O2S2/c1-9-7-10-3-2-4-12(11(10)8-9)18-23(20,21)14-13(16)17-15-19(14)5-6-22-15/h2-7,18H,8H2,1H3
Reactome pathway
n/an/an/an/an/an/an/a7.437
Universitat de Barcelona
Assay Description
Radioligand binding assays were performed using membranes from HEK-293 transfected with human 5-HT6 receptor. In these membranes the receptor concent...
Bioorg Med Chem 17: 7387-97 (2009)
Article DOI: 10.1016/j.bmc.2009.08.006
BindingDB Entry DOI: 10.7270/Q2RR1WKS