BDBM3423 2-(3-hydroxy-4-{2-[(2-hydroxyethyl)(2-phenylpropan-2-yl)carbamoyl]phenyl}butyl)-N-(2-hydroxyethyl)-N-(2-phenylpropan-2-yl)benzamide::Tertiary Amide deriv. 40bb::diarylbutanol deriv. 11
SMILES: CC(C)(N(CCO)C(=O)c1ccccc1CCC(O)Cc1ccccc1C(=O)N(CCO)C(C)(C)c1ccccc1)c1ccccc1
InChI Key: InChIKey=NHGJCQDJVVIEHB-UHFFFAOYSA-N
Data: 2 KI
Activity Spreadsheet -- Enzyme Inhibition Constant Data from BindingDB
Found 2 hits for monomerid = 3423
Trg + Lig
Ki
nM
ΔG°
kcal/mole
IC50
nM
Kd
nM
EC50/IC50
nM
koff
s-1
kon
M-1s-1
pHTemp
°C
HIV-1 Protease
(Human immunodeficiency virus type 1)
BDBM3423
(2-(3-hydroxy-4-{2-[(2-hydroxyethyl)(2-phenylpropan...)
Show SMILES CC(C)(N(CCO)C(=O)c1ccccc1CCC(O)Cc1ccccc1C(=O)N(CCO)C(C)(C)c1ccccc1)c1ccccc1
Show InChI InChI=1S/C40H48N2O5/c1-39(2,32-17-7-5-8-18-32)41(25-27-43)37(46)35-21-13-11-15-30(35)23-24-34(45)29-31-16-12-14-22-36(31)38(47)42(26-28-44)40(3,4)33-19-9-6-10-20-33/h5-22,34,43-45H,23-29H2,1-4H3
21 -10.9n/an/an/an/an/a5.637
Agouron Pharmaceuticals, Inc.
Assay Description
Protease activity was measured by continuous chromogenic assay. The chromogenic peptide His-Lys-Ala-Arg-Val-Leu-(p-NO2-Phe)-Glu-Ala-Nleu-Ser was use...
J Med Chem 39: 2795-811 (1996)
Article DOI: 10.1021/jm960092w
BindingDB Entry DOI: 10.7270/Q2028PRG
HIV-1 Protease
(Human immunodeficiency virus type 1)
BDBM3423
(2-(3-hydroxy-4-{2-[(2-hydroxyethyl)(2-phenylpropan...)
Show SMILES CC(C)(N(CCO)C(=O)c1ccccc1CCC(O)Cc1ccccc1C(=O)N(CCO)C(C)(C)c1ccccc1)c1ccccc1
Show InChI InChI=1S/C40H48N2O5/c1-39(2,32-17-7-5-8-18-32)41(25-27-43)37(46)35-21-13-11-15-30(35)23-24-34(45)29-31-16-12-14-22-36(31)38(47)42(26-28-44)40(3,4)33-19-9-6-10-20-33/h5-22,34,43-45H,23-29H2,1-4H3
22 -10.9n/an/an/an/an/a5.637
Agouron Pharmaceuticals, Inc.
Assay Description
Protease activity was measured by continuous chromogenic assay. The chromogenic peptide His-Lys-Ala-Arg-Val-Leu- (p-NO2-Phe)-Glu-Ala-Nleu-Ser (Bache...
Proc Natl Acad Sci U S A 92: 3298-302 (1995)
Article DOI: 10.1073/pnas.92.8.3298
BindingDB Entry DOI: 10.7270/Q2F769RX