BDBM343035 1-(2-chloro-3'-fluoro-5-methoxy-4-biphenylyl)-4-hydroxy-N-3-isoxazolyl-6-isoquinolinesulfonamide::US9776995, Example 17
SMILES: COc1cc(c(Cl)cc1-c1ncc(O)c2cc(ccc12)S(=O)(=O)Nc1ccon1)-c1cccc(F)c1
InChI Key: InChIKey=HSCRCEFYDVLJFT-UHFFFAOYSA-N
Data: 4 IC50
Activity Spreadsheet -- Enzyme Inhibition Constant Data from BindingDB
Found 4 hits for monomerid = 343035
Trg + Lig
Ki
nM
ΔG°
kcal/mole
IC50
nM
Kd
nM
EC50/IC50
nM
koff
s-1
kon
M-1s-1
pHTemp
°C
Sodium channel protein type 9 subunit alpha
(Homo sapiens (Human))
BDBM343035
(1-(2-chloro-3'-fluoro-5-methoxy-4-biphenylyl)-4-hy...)
Show SMILES COc1cc(c(Cl)cc1-c1ncc(O)c2cc(ccc12)S(=O)(=O)Nc1ccon1)-c1cccc(F)c1
Show InChI InChI=1S/C25H17ClFN3O5S/c1-34-23-12-18(14-3-2-4-15(27)9-14)21(26)11-20(23)25-17-6-5-16(10-19(17)22(31)13-28-25)36(32,33)30-24-7-8-35-29-24/h2-13,31H,1H3,(H,29,30)
US Patent
n/an/a 85.1n/an/an/an/an/an/a
Amgen Inc.
US Patent
Assay Description
HEK 293 cells stably transfected with human Nav1.7 were recorded in whole cell voltage clamp mode with the PatchXpress automated electrophysiology sy...
US Patent US9776995 (2017)
BindingDB Entry DOI: 10.7270/Q2Q81G6R
Sodium channel protein type 5 subunit alpha
(Homo sapiens (Human))
BDBM343035
(1-(2-chloro-3'-fluoro-5-methoxy-4-biphenylyl)-4-hy...)
Show SMILES COc1cc(c(Cl)cc1-c1ncc(O)c2cc(ccc12)S(=O)(=O)Nc1ccon1)-c1cccc(F)c1
Show InChI InChI=1S/C25H17ClFN3O5S/c1-34-23-12-18(14-3-2-4-15(27)9-14)21(26)11-20(23)25-17-6-5-16(10-19(17)22(31)13-28-25)36(32,33)30-24-7-8-35-29-24/h2-13,31H,1H3,(H,29,30)
n/an/a>1.00E+4n/an/an/an/an/an/a
Amgen Inc.
Curated by ChEMBL
Assay Description
Inhibition of human Nav1.5 expressed in HEK293 cells assessed as reduction in peak inward current by ionworks quattro electrophysiology assay
J Med Chem 60: 5969-5989 (2017)
Article DOI: 10.1021/acs.jmedchem.6b01851
BindingDB Entry DOI: 10.7270/Q2RJ4MS7
Sodium channel protein type 9 subunit alpha
(Homo sapiens (Human))
BDBM343035
(1-(2-chloro-3'-fluoro-5-methoxy-4-biphenylyl)-4-hy...)
Show SMILES COc1cc(c(Cl)cc1-c1ncc(O)c2cc(ccc12)S(=O)(=O)Nc1ccon1)-c1cccc(F)c1
Show InChI InChI=1S/C25H17ClFN3O5S/c1-34-23-12-18(14-3-2-4-15(27)9-14)21(26)11-20(23)25-17-6-5-16(10-19(17)22(31)13-28-25)36(32,33)30-24-7-8-35-29-24/h2-13,31H,1H3,(H,29,30)
n/an/a 85n/an/an/an/an/an/a
Amgen Inc.
Curated by ChEMBL
Assay Description
Inhibition of human Nav1.7 expressed in HEK293 cells incubated for 3 to 5 mins at -125 mV holding potential by electrophysiology assay
J Med Chem 60: 5969-5989 (2017)
Article DOI: 10.1021/acs.jmedchem.6b01851
BindingDB Entry DOI: 10.7270/Q2RJ4MS7
Sodium channel protein type 5 subunit alpha
(Homo sapiens (Human))
BDBM343035
(1-(2-chloro-3'-fluoro-5-methoxy-4-biphenylyl)-4-hy...)
Show SMILES COc1cc(c(Cl)cc1-c1ncc(O)c2cc(ccc12)S(=O)(=O)Nc1ccon1)-c1cccc(F)c1
Show InChI InChI=1S/C25H17ClFN3O5S/c1-34-23-12-18(14-3-2-4-15(27)9-14)21(26)11-20(23)25-17-6-5-16(10-19(17)22(31)13-28-25)36(32,33)30-24-7-8-35-29-24/h2-13,31H,1H3,(H,29,30)
US Patent
n/an/a>1.00E+4n/an/an/an/an/an/a
Amgen Inc.
US Patent
Assay Description
293 cells stably transfected with Nav 1.5 were recorded in whole cell voltage clamp mode with the PatchXpress automated electrophysiology system acco...
US Patent US9776995 (2017)
BindingDB Entry DOI: 10.7270/Q2Q81G6R