BDBM343814 US9777008, Compound 108
SMILES: Cn1ncc2cc(ccc12)-c1cccc(OCC(O)CN2CCc3ccccc3C2)c1
InChI Key: InChIKey=HIZGCKWNKSVHDJ-UHFFFAOYSA-N
Data: 1 IC50
Activity Spreadsheet -- Enzyme Inhibition Constant Data from BindingDB
Found 1 hit for monomerid = 343814
Trg + Lig
Ki
nM
ΔG°
kcal/mole
IC50
nM
Kd
nM
EC50/IC50
nM
koff
s-1
kon
M-1s-1
pHTemp
°C
PRMT5/MEP50 Enzyme
(Homo sapiens (Human))
BDBM343814
(US9777008, Compound 108)
Show SMILES Cn1ncc2cc(ccc12)-c1cccc(OCC(O)CN2CCc3ccccc3C2)c1
Show InChI InChI=1S/C26H27N3O2/c1-28-26-10-9-21(13-23(26)15-27-28)20-7-4-8-25(14-20)31-18-24(30)17-29-12-11-19-5-2-3-6-22(19)16-29/h2-10,13-15,24,30H,11-12,16-18H2,1H3
US Patent
n/an/a<100n/an/an/an/an/an/a
Epizyme, Inc.
US Patent
Assay Description
The assays were all performed in a buffer consisting of 20 mM Bicine (pH=7.6), 1 mM TCEP, 0.005% BSG, and 0.002% Tween20, prepared on the day of use....
US Patent US9777008 (2017)
BindingDB Entry DOI: 10.7270/Q26975QQ