BDBM343944 1-(3,4-dihydroisoquinolin-2(1H)-yl)-3-((4-(3-methyl-3H-imidazo[4,5-b]pyridin-5-yl)pyridin-2-yl)amino)propan-2-ol::US9777008, Compound 238
SMILES: Cn1cnc2ccc(nc12)-c1ccnc(NCC(O)CN2CCc3ccccc3C2)c1
InChI Key: InChIKey=KDJMIAKLQTYCGG-UHFFFAOYSA-N
Data: 1 IC50
Activity Spreadsheet -- Enzyme Inhibition Constant Data from BindingDB
Found 1 hit for monomerid = 343944
Trg + Lig
Ki
nM
ΔG°
kcal/mole
IC50
nM
Kd
nM
EC50/IC50
nM
koff
s-1
kon
M-1s-1
pHTemp
°C
PRMT5/MEP50 Enzyme
(Homo sapiens (Human))
BDBM343944
(1-(3,4-dihydroisoquinolin-2(1H)-yl)-3-((4-(3-methy...)
Show SMILES Cn1cnc2ccc(nc12)-c1ccnc(NCC(O)CN2CCc3ccccc3C2)c1
Show InChI InChI=1S/C24H26N6O/c1-29-16-27-22-7-6-21(28-24(22)29)18-8-10-25-23(12-18)26-13-20(31)15-30-11-9-17-4-2-3-5-19(17)14-30/h2-8,10,12,16,20,31H,9,11,13-15H2,1H3,(H,25,26)
US Patent
n/an/a<100n/an/an/an/an/an/a
Epizyme, Inc.
US Patent
Assay Description
The assays were all performed in a buffer consisting of 20 mM Bicine (pH=7.6), 1 mM TCEP, 0.005% BSG, and 0.002% Tween20, prepared on the day of use....
US Patent US9777008 (2017)
BindingDB Entry DOI: 10.7270/Q26975QQ