BDBM343945 1-(3,4-dihydroisoquinolin-2(1H)-yl)-3-((4-(7-methyl-7H-pyrrolo[2,3-d]pyrimidin-2-yl)pyridin-2-yl)amino)propan-2-ol::US9777008, Compound 239
SMILES: Cn1ccc2cnc(nc12)-c1ccnc(NCC(O)CN2CCc3ccccc3C2)c1
InChI Key: InChIKey=NQMDFLAWMADNQY-UHFFFAOYSA-N
Data: 1 IC50
Activity Spreadsheet -- Enzyme Inhibition Constant Data from BindingDB
Found 1 hit for monomerid = 343945
Trg + Lig
Ki
nM
ΔG°
kcal/mole
IC50
nM
Kd
nM
EC50/IC50
nM
koff
s-1
kon
M-1s-1
pHTemp
°C
PRMT5/MEP50 Enzyme
(Homo sapiens (Human))
BDBM343945
(1-(3,4-dihydroisoquinolin-2(1H)-yl)-3-((4-(7-methy...)
Show SMILES Cn1ccc2cnc(nc12)-c1ccnc(NCC(O)CN2CCc3ccccc3C2)c1
Show InChI InChI=1S/C24H26N6O/c1-29-10-7-19-13-27-23(28-24(19)29)18-6-9-25-22(12-18)26-14-21(31)16-30-11-8-17-4-2-3-5-20(17)15-30/h2-7,9-10,12-13,21,31H,8,11,14-16H2,1H3,(H,25,26)
US Patent
n/an/a<100n/an/an/an/an/an/a
Epizyme, Inc.
US Patent
Assay Description
The assays were all performed in a buffer consisting of 20 mM Bicine (pH=7.6), 1 mM TCEP, 0.005% BSG, and 0.002% Tween20, prepared on the day of use....
US Patent US9777008 (2017)
BindingDB Entry DOI: 10.7270/Q26975QQ