null
SMILES: Cn1nccc1-c1ccc(cc1)S(=O)(=O)N1CCN=C1N1CCN(CC1)C1CCC1
InChI Key: InChIKey=UPJRZRYMPURGJS-UHFFFAOYSA-N
Activity Spreadsheet -- Enzyme Inhibition Constant Data from BindingDB
Found 1 hit for monomerid = 345364
Trg + Lig
Ki
nM
ΔG°
kcal/mole
IC50
nM
Kd
nM
EC50/IC50
nM
koff
s-1
kon
M-1s-1
pHTemp
°C
Lysine-specific demethylase 2B
(Homo sapiens (Human))
BDBM345364
(1-cyclobutyl-4-[1-[4-(2-methylpyrazol-3-yl)phenyl]...)
Show SMILES Cn1nccc1-c1ccc(cc1)S(=O)(=O)N1CCN=C1N1CCN(CC1)C1CCC1 |c:20|
Show InChI InChI=1S/C21H28N6O2S/c1-24-20(9-10-23-24)17-5-7-19(8-6-17)30(28,29)27-12-11-22-21(27)26-15-13-25(14-16-26)18-3-2-4-18/h5-10,18H,2-4,11-16H2,1H3
US Patent
n/an/a 0.0490n/an/an/an/an/an/a
GENENTECH, INC.; CONSTELLATION PHARMACEUTICALS, INC.
US Patent
Assay Description
Full length KDM2B was cloned, expressed, and purified to homogeneity. Compound inhibition of KDM2B demethylase activity was assessed by monitoring th...
US Patent US10202354 (2019)
BindingDB Entry DOI: 10.7270/Q2VT1V62