BDBM345376 US10202354, Example 41
SMILES: CC(C)c1ccc(cc1)S(=O)(=O)N1C[C@H](N=C1N1CCN(CC1)C1CCC1)C1CC1
InChI Key: InChIKey=JCZZXBBNDUHTEO-QFIPXVFZSA-N
Data: 1 IC50
Activity Spreadsheet -- Enzyme Inhibition Constant Data from BindingDB
Found 1 hit for monomerid = 345376
Trg + Lig
Ki
nM
ΔG°
kcal/mole
IC50
nM
Kd
nM
EC50/IC50
nM
koff
s-1
kon
M-1s-1
pHTemp
°C
Lysine-specific demethylase 2B
(Homo sapiens (Human))
BDBM345376
(US10202354, Example 41)
Show SMILES CC(C)c1ccc(cc1)S(=O)(=O)N1C[C@H](N=C1N1CCN(CC1)C1CCC1)C1CC1 |r,c:16|
Show InChI InChI=1S/C23H34N4O2S/c1-17(2)18-8-10-21(11-9-18)30(28,29)27-16-22(19-6-7-19)24-23(27)26-14-12-25(13-15-26)20-4-3-5-20/h8-11,17,19-20,22H,3-7,12-16H2,1-2H3/t22-/m0/s1
US Patent
n/an/a 0.0390n/an/an/an/an/an/a
GENENTECH, INC.; CONSTELLATION PHARMACEUTICALS, INC.
US Patent
Assay Description
Full length KDM2B was cloned, expressed, and purified to homogeneity. Compound inhibition of KDM2B demethylase activity was assessed by monitoring th...
US Patent US10202354 (2019)
BindingDB Entry DOI: 10.7270/Q2VT1V62