BDBM34539 US8546434, 13
SMILES: COC(C)(C)[C@@H](N(C[C@@H]1CNC[C@@H]1F)C(=O)[C@@H]1CCCO1)c1nc(nn1Cc1ccccc1)-c1cc(F)ccc1F
InChI Key: InChIKey=GMRFPMLJHOFDDW-UHFFFAOYSA-N
Data: 1 IC50
Activity Spreadsheet -- Enzyme Inhibition Constant Data from BindingDB
Found 1 hit for monomerid = 34539
Trg + Lig
Ki
nM
ΔG°
kcal/mole
IC50
nM
Kd
nM
EC50/IC50
nM
koff
s-1
kon
M-1s-1
pHTemp
°C
kinesin spindle protein
(Homo sapiens (Human))
BDBM34539
(US8546434, 13)
Show SMILES COC(C)(C)[C@@H](N(C[C@@H]1CNC[C@@H]1F)C(=O)[C@@H]1CCCO1)c1nc(nn1Cc1ccccc1)-c1cc(F)ccc1F |r|
Show InChI InChI=1S/C13H17N3O3S2/c1-13(2,3)11-14-15-12(20-11)16-21(17,18)10-7-5-9(19-4)6-8-10/h5-8H,1-4H3,(H,15,16)
Reactome pathway
US Patent
n/an/a 0.690n/an/an/an/an/an/a
Novartis AG
US Patent
Assay Description
In vitro activity assay using KSP.
US Patent US8546434 (2013)
BindingDB Entry DOI: 10.7270/Q25D8QG9