BDBM345410 1-cyclobutyl-4-(1-indan-5-ylsulfonyl-4,5-dihydroimidazol-2-yl)piperazine::US10202354, Example 75
SMILES: O=S(=O)(N1CCN=C1N1CCN(CC1)C1CCC1)c1ccc2CCCc2c1
InChI Key: InChIKey=TVJKSFRSPWYHQE-UHFFFAOYSA-N
Data: 1 IC50
Activity Spreadsheet -- Enzyme Inhibition Constant Data from BindingDB
Found 1 hit for monomerid = 345410
Trg + Lig
Ki
nM
ΔG°
kcal/mole
IC50
nM
Kd
nM
EC50/IC50
nM
koff
s-1
kon
M-1s-1
pHTemp
°C
Lysine-specific demethylase 2B
(Homo sapiens (Human))
BDBM345410
(1-cyclobutyl-4-(1-indan-5-ylsulfonyl-4,5-dihydroim...)
Show SMILES O=S(=O)(N1CCN=C1N1CCN(CC1)C1CCC1)c1ccc2CCCc2c1 |c:6|
Show InChI InChI=1S/C20H28N4O2S/c25-27(26,19-8-7-16-3-1-4-17(16)15-19)24-10-9-21-20(24)23-13-11-22(12-14-23)18-5-2-6-18/h7-8,15,18H,1-6,9-14H2
US Patent
n/an/a 0.0310n/an/an/an/an/an/a
GENENTECH, INC.; CONSTELLATION PHARMACEUTICALS, INC.
US Patent
Assay Description
Full length KDM2B was cloned, expressed, and purified to homogeneity. Compound inhibition of KDM2B demethylase activity was assessed by monitoring th...
US Patent US10202354 (2019)
BindingDB Entry DOI: 10.7270/Q2VT1V62