null
SMILES: Cc1cc2nc([nH]c2cc1Nc1nc(cs1)-c1cccnc1)-c1cccc(Cl)c1
InChI Key: InChIKey=LWFUTORIKZJXGV-UHFFFAOYSA-N
Activity Spreadsheet -- Enzyme Inhibition Constant Data from BindingDB
Found 1 hit for monomerid = 346027
Trg + Lig
Ki
nM
ΔG°
kcal/mole
IC50
nM
Kd
nM
EC50/IC50
nM
koff
s-1
kon
M-1s-1
pHTemp
°C
Mast/stem cell growth factor receptor Kit
(Homo sapiens (Human))
BDBM346027
(US10202370, Example 032 | [2-(3-Chloro-phenyl)- 6-...)
Show SMILES Cc1cc2nc([nH]c2cc1Nc1nc(cs1)-c1cccnc1)-c1cccc(Cl)c1
Show InChI InChI=1S/C22H16ClN5S/c1-13-8-18-19(26-21(25-18)14-4-2-6-16(23)9-14)10-17(13)27-22-28-20(12-29-22)15-5-3-7-24-11-15/h2-12H,1H3,(H,25,26)(H,27,28)
US Patent
n/an/an/an/a<1.00E+3n/an/an/an/a
AB SCIENCE
US Patent
Assay Description
Colorimetric cell proliferation and viability assay (reagent CellTiter-Blue purchased from Promega cat N°G8081) was performed on BaF3 Kit WT cell lin...
US Patent US10202370 (2019)
BindingDB Entry DOI: 10.7270/Q2Q52RRK