BDBM346049 US10202370, Example 078::[6-Methyl-2-(5- methyl-thiophen-2- yl)-3H- benzoimidazol-5-yl]- (4-pyridin-3-yl- thiazol-2-yl)-amine
SMILES: Cc1ccc(s1)-c1nc2cc(C)c(Nc3nc(cs3)-c3cccnc3)cc2[nH]1
InChI Key: InChIKey=WAWCVTDNTGRJIN-UHFFFAOYSA-N
Data: 1 EC50
Activity Spreadsheet -- Enzyme Inhibition Constant Data from BindingDB
Found 1 hit for monomerid = 346049
Trg + Lig
Ki
nM
ΔG°
kcal/mole
IC50
nM
Kd
nM
EC50/IC50
nM
koff
s-1
kon
M-1s-1
pHTemp
°C
Mast/stem cell growth factor receptor Kit
(Homo sapiens (Human))
BDBM346049
(US10202370, Example 078 | [6-Methyl-2-(5- methyl-t...)
Show SMILES Cc1ccc(s1)-c1nc2cc(C)c(Nc3nc(cs3)-c3cccnc3)cc2[nH]1
Show InChI InChI=1S/C21H17N5S2/c1-12-8-16-17(24-20(23-16)19-6-5-13(2)28-19)9-15(12)25-21-26-18(11-27-21)14-4-3-7-22-10-14/h3-11H,1-2H3,(H,23,24)(H,25,26)
US Patent
n/an/an/an/a<1.00E+3n/an/an/an/a
AB SCIENCE
US Patent
Assay Description
Colorimetric cell proliferation and viability assay (reagent CellTiter-Blue purchased from Promega cat N°G8081) was performed on BaF3 Kit WT cell lin...
US Patent US10202370 (2019)
BindingDB Entry DOI: 10.7270/Q2Q52RRK