BDBM346248 2-[4-(2-methylpyrazol-3-yl)pyrazolo[3,4-d]pyrimidin-1-yl]-N-(5-pyrazin-2-yl-2-pyridyl)acetamide::US10202375, Example 11
SMILES: O=C(Cn1ccc2c(ncnc12)N1CCCCC1)Nc1ccc(cn1)-c1cnccn1
InChI Key: InChIKey=OMRWAPRYORERQL-UHFFFAOYSA-N
Data: 1 IC50
Activity Spreadsheet -- Enzyme Inhibition Constant Data from BindingDB
Found 1 hit for monomerid = 346248
Trg + Lig
Ki
nM
ΔG°
kcal/mole
IC50
nM
Kd
nM
EC50/IC50
nM
koff
s-1
kon
M-1s-1
pHTemp
°C
Protein Wnt-3a
(Mus musculus)
BDBM346248
(2-[4-(2-methylpyrazol-3-yl)pyrazolo[3,4-d]pyrimidi...)
Show SMILES O=C(Cn1ccc2c(ncnc12)N1CCCCC1)Nc1ccc(cn1)-c1cnccn1
Show InChI InChI=1S/C22H22N8O/c31-20(28-19-5-4-16(12-25-19)18-13-23-7-8-24-18)14-30-11-6-17-21(26-15-27-22(17)30)29-9-2-1-3-10-29/h4-8,11-13,15H,1-3,9-10,14H2,(H,25,28,31)
Reactome pathway
US Patent
n/an/a<1n/an/an/an/an/an/a
Redx Pharma PLC
US Patent
Assay Description
Mouse L cells transfected to constitutively produce biologically active murine Wnt-3a, referred to as L-Wnt cells, were purchased from the American T...
US Patent US10202375 (2019)
BindingDB Entry DOI: 10.7270/Q29W0HMN