BDBM34650 (4E)-5-amino-6-(7-amino-5,8-diketo-6-methoxy-2-quinolyl)-4-(6-keto-4,5-dimethoxy-cyclohexa-2,4-dien-1-ylidene)-3-methyl-1H-pyridine-2-carboxylic acid::(4E)-5-amino-6-(7-amino-6-methoxy-5,8-dioxo-2-quinolinyl)-4-(4,5-dimethoxy-6-oxo-1-cyclohexa-2,4-dienylidene)-3-methyl-1H-pyridine-2-carboxylic acid::(4E)-5-amino-6-(7-amino-6-methoxy-5,8-dioxoquinolin-2-yl)-4-(4,5-dimethoxy-6-oxocyclohexa-2,4-dien-1-ylidene)-3-methyl-1H-pyridine-2-carboxylic acid::(4E)-5-azanyl-6-[7-azanyl-6-methoxy-5,8-bis(oxidanylidene)quinolin-2-yl]-4-(4,5-dimethoxy-6-oxidanylidene-cyclohexa-2,4-dien-1-ylidene)-3-methyl-1H-pyridine-2-carboxylic acid::BRUNEOMYCIN::MLS000028827::SMR000058748::cid_5323583
SMILES: COC1=C(N)C(=O)c2nc(ccc2C1=O)-c1nc(C(O)=O)c(C)c(c1N)-c1ccc(OC)c(OC)c1O
InChI Key: InChIKey=PVYJZLYGTZKPJE-UHFFFAOYSA-N
Data: 2 IC50
Activity Spreadsheet -- Enzyme Inhibition Constant Data from BindingDB
Found 2 hits for monomerid = 34650
Trg + Lig
Ki
nM
ΔG°
kcal/mole
IC50
nM
Kd
nM
EC50/IC50
nM
koff
s-1
kon
M-1s-1
pHTemp
°C
protein-arginine deiminase type-4
(Homo sapiens (Human))
BDBM34650
((4E)-5-amino-6-(7-amino-5,8-diketo-6-methoxy-2-qui...)
Show SMILES COC1=C(N)C(=O)c2nc(ccc2C1=O)-c1nc(C(O)=O)c(C)c(c1N)-c1ccc(OC)c(OC)c1O |c:2,(3.91,5.12,;3.91,3.58,;5.24,2.81,;5.24,1.27,;3.91,.5,;6.57,.5,;6.57,-1.04,;7.91,1.27,;9.28,.44,;10.68,1.23,;10.68,2.84,;9.28,3.63,;7.91,2.81,;6.57,3.58,;6.57,5.12,;12.01,.46,;12,-1.08,;13.34,-1.86,;13.33,-3.4,;11.99,-4.16,;14.66,-4.17,;14.67,-1.09,;16,-1.87,;14.68,.45,;13.35,1.22,;13.35,2.76,;16.01,1.21,;16.02,2.75,;17.36,3.52,;18.69,2.74,;20.02,3.51,;20.03,5.05,;18.68,1.2,;20.01,.43,;21.35,1.19,;17.35,.44,;17.34,-1.1,)|
Show InChI InChI=1S/C25H22N4O8/c1-9-14(10-6-8-13(35-2)23(36-3)20(10)30)15(26)19(29-17(9)25(33)34)12-7-5-11-18(28-12)22(32)16(27)24(37-4)21(11)31/h5-8,30H,26-27H2,1-4H3,(H,33,34)
PCBioAssay
n/an/a 2.50E+3n/an/an/an/an/an/a
The Scripps Research Institute Molecular Screening Center
Curated by PubChem BioAssay
Assay Description
Source (MLPCN Center Name): The Scripps Research Institute Molecular Screening Center (SRIMSC) Affiliation: The Scripps Research Institute, TSRI Assa...
PubChem Bioassay (2010)
BindingDB Entry DOI: 10.7270/Q2PK0DMQ
MPI protein
(Homo sapiens (Human))
BDBM34650
((4E)-5-amino-6-(7-amino-5,8-diketo-6-methoxy-2-qui...)
Show SMILES COC1=C(N)C(=O)c2nc(ccc2C1=O)-c1nc(C(O)=O)c(C)c(c1N)-c1ccc(OC)c(OC)c1O |c:2,(3.91,5.12,;3.91,3.58,;5.24,2.81,;5.24,1.27,;3.91,.5,;6.57,.5,;6.57,-1.04,;7.91,1.27,;9.28,.44,;10.68,1.23,;10.68,2.84,;9.28,3.63,;7.91,2.81,;6.57,3.58,;6.57,5.12,;12.01,.46,;12,-1.08,;13.34,-1.86,;13.33,-3.4,;11.99,-4.16,;14.66,-4.17,;14.67,-1.09,;16,-1.87,;14.68,.45,;13.35,1.22,;13.35,2.76,;16.01,1.21,;16.02,2.75,;17.36,3.52,;18.69,2.74,;20.02,3.51,;20.03,5.05,;18.68,1.2,;20.01,.43,;21.35,1.19,;17.35,.44,;17.34,-1.1,)|
Show InChI InChI=1S/C25H22N4O8/c1-9-14(10-6-8-13(35-2)23(36-3)20(10)30)15(26)19(29-17(9)25(33)34)12-7-5-11-18(28-12)22(32)16(27)24(37-4)21(11)31/h5-8,30H,26-27H2,1-4H3,(H,33,34)
Reactome pathway
PCBioAssay
n/an/a>5.00E+4n/an/an/an/a7.423
Burnham Center for Chemical Genomics
Curated by PubChem BioAssay
Assay Description
The purpose of this assay is to identify non-competititve inhibitors of human PMI. This is accomplished by using a G6PD- NADPH-coupled assay. In the ...
PubChem Bioassay (2009)
BindingDB Entry DOI: 10.7270/Q2CF9NFM