BDBM3467 3-tert-butyl-1-[6-(2,6-dichlorophenyl)-2-{[4-(4-methylpiperazin-1-yl)butyl]amino}pyrido[2,3-d]pyrimidin-7-yl]urea::6-arylpyrido[2,3-d]pyrimidine deriv. 49
SMILES: CN1CCN(CCCCNc2ncc3cc(c(NC(=O)NC(C)(C)C)nc3n2)-c2c(Cl)cccc2Cl)CC1
InChI Key: InChIKey=BUUXCZKMEAGSSK-UHFFFAOYSA-N
Data: 3 IC50
Activity Spreadsheet -- Enzyme Inhibition Constant Data from BindingDB
Found 3 hits for monomerid = 3467
Trg + Lig
Ki
nM
ΔG°
kcal/mole
IC50
nM
Kd
nM
EC50/IC50
nM
koff
s-1
kon
M-1s-1
pHTemp
°C
Platelet-derived growth factor receptor beta
(Homo sapiens (Human))
BDBM3467
(3-tert-butyl-1-[6-(2,6-dichlorophenyl)-2-{[4-(4-me...)
Show SMILES CN1CCN(CCCCNc2ncc3cc(c(NC(=O)NC(C)(C)C)nc3n2)-c2c(Cl)cccc2Cl)CC1 |(-15.76,4.51,;-14.27,4.11,;-12.91,4.83,;-11.61,4.02,;-11.66,2.48,;-10.57,1.39,;-9.09,1.79,;-8,.7,;-6.51,1.1,;-5.18,.33,;-3.84,1.1,;-3.84,2.64,;-2.51,3.41,;-1.17,2.64,;.16,3.41,;1.49,2.64,;1.49,1.1,;2.83,.33,;2.83,-1.21,;1.49,-1.98,;4.16,-1.98,;4.16,-3.52,;5.49,-4.29,;2.83,-4.29,;4.16,-5.06,;.16,.33,;-1.17,1.1,;-2.51,.33,;2.83,3.41,;2.83,4.95,;1.49,5.72,;4.16,5.72,;5.49,4.95,;5.49,3.41,;4.16,2.64,;4.16,1.1,;-13.02,1.76,;-14.33,2.57,)|
Show InChI InChI=1S/C27H36Cl2N8O/c1-27(2,3)35-26(38)34-24-19(22-20(28)8-7-9-21(22)29)16-18-17-31-25(33-23(18)32-24)30-10-5-6-11-37-14-12-36(4)13-15-37/h7-9,16-17H,5-6,10-15H2,1-4H3,(H3,30,31,32,33,34,35,38)
NCI pathway
Reactome pathway
n/an/a 280n/an/an/an/an/an/a
Pfizer
Assay Description
IC50 is the inhibitor concentration which inhibits 50% of kinase activity that catalyzes the transfer of the terminal phosphate from [gamma-32P] labe...
J Med Chem 44: 1915-26 (2001)
Article DOI: 10.1021/jm0004291
BindingDB Entry DOI: 10.7270/Q29K48DG
Proto-oncogene tyrosine-protein kinase Src
(Homo sapiens (Human))
BDBM3467
(3-tert-butyl-1-[6-(2,6-dichlorophenyl)-2-{[4-(4-me...)
Show SMILES CN1CCN(CCCCNc2ncc3cc(c(NC(=O)NC(C)(C)C)nc3n2)-c2c(Cl)cccc2Cl)CC1 |(-15.76,4.51,;-14.27,4.11,;-12.91,4.83,;-11.61,4.02,;-11.66,2.48,;-10.57,1.39,;-9.09,1.79,;-8,.7,;-6.51,1.1,;-5.18,.33,;-3.84,1.1,;-3.84,2.64,;-2.51,3.41,;-1.17,2.64,;.16,3.41,;1.49,2.64,;1.49,1.1,;2.83,.33,;2.83,-1.21,;1.49,-1.98,;4.16,-1.98,;4.16,-3.52,;5.49,-4.29,;2.83,-4.29,;4.16,-5.06,;.16,.33,;-1.17,1.1,;-2.51,.33,;2.83,3.41,;2.83,4.95,;1.49,5.72,;4.16,5.72,;5.49,4.95,;5.49,3.41,;4.16,2.64,;4.16,1.1,;-13.02,1.76,;-14.33,2.57,)|
Show InChI InChI=1S/C27H36Cl2N8O/c1-27(2,3)35-26(38)34-24-19(22-20(28)8-7-9-21(22)29)16-18-17-31-25(33-23(18)32-24)30-10-5-6-11-37-14-12-36(4)13-15-37/h7-9,16-17H,5-6,10-15H2,1-4H3,(H3,30,31,32,33,34,35,38)
n/an/a 10n/an/an/an/an/an/a
Pfizer
Assay Description
IC50 is the inhibitor concentration which inhibits 50% of kinase activity that catalyzes the transfer of the terminal phosphate from [gamma-32P] labe...
J Med Chem 44: 1915-26 (2001)
Article DOI: 10.1021/jm0004291
BindingDB Entry DOI: 10.7270/Q29K48DG
Fibroblast growth factor receptor 1
(Homo sapiens (Human))
BDBM3467
(3-tert-butyl-1-[6-(2,6-dichlorophenyl)-2-{[4-(4-me...)
Show SMILES CN1CCN(CCCCNc2ncc3cc(c(NC(=O)NC(C)(C)C)nc3n2)-c2c(Cl)cccc2Cl)CC1 |(-15.76,4.51,;-14.27,4.11,;-12.91,4.83,;-11.61,4.02,;-11.66,2.48,;-10.57,1.39,;-9.09,1.79,;-8,.7,;-6.51,1.1,;-5.18,.33,;-3.84,1.1,;-3.84,2.64,;-2.51,3.41,;-1.17,2.64,;.16,3.41,;1.49,2.64,;1.49,1.1,;2.83,.33,;2.83,-1.21,;1.49,-1.98,;4.16,-1.98,;4.16,-3.52,;5.49,-4.29,;2.83,-4.29,;4.16,-5.06,;.16,.33,;-1.17,1.1,;-2.51,.33,;2.83,3.41,;2.83,4.95,;1.49,5.72,;4.16,5.72,;5.49,4.95,;5.49,3.41,;4.16,2.64,;4.16,1.1,;-13.02,1.76,;-14.33,2.57,)|
Show InChI InChI=1S/C27H36Cl2N8O/c1-27(2,3)35-26(38)34-24-19(22-20(28)8-7-9-21(22)29)16-18-17-31-25(33-23(18)32-24)30-10-5-6-11-37-14-12-36(4)13-15-37/h7-9,16-17H,5-6,10-15H2,1-4H3,(H3,30,31,32,33,34,35,38)
NCI pathway
Reactome pathway
n/an/a 35n/an/an/an/an/an/a
Pfizer
Assay Description
IC50 is the inhibitor concentration which inhibits 50% of kinase activity that catalyzes the transfer of the terminal phosphate from [gamma-32P] labe...
J Med Chem 44: 1915-26 (2001)
Article DOI: 10.1021/jm0004291
BindingDB Entry DOI: 10.7270/Q29K48DG