BDBM347063 US10202390, Example 18
SMILES: CCCn1cc(nn1)-c1cnc(cc1NC1CC1)-c1cnc2cc(cnn12)C#N
InChI Key: InChIKey=JDHXZJLBUNAELN-UHFFFAOYSA-N
Data: 1 IC50
Activity Spreadsheet -- Enzyme Inhibition Constant Data from BindingDB
Found 1 hit for monomerid = 347063
Trg + Lig
Ki
nM
ΔG°
kcal/mole
IC50
nM
Kd
nM
EC50/IC50
nM
koff
s-1
kon
M-1s-1
pHTemp
°C
G protein-activated inward rectifier potassium channel 4
(Homo sapiens (Human))
BDBM347063
(US10202390, Example 18)
Show SMILES CCCn1cc(nn1)-c1cnc(cc1NC1CC1)-c1cnc2cc(cnn12)C#N
Show InChI InChI=1S/C20H19N9/c1-2-5-28-12-18(26-27-28)15-10-22-17(7-16(15)25-14-3-4-14)19-11-23-20-6-13(8-21)9-24-29(19)20/h6-7,9-12,14H,2-5H2,1H3,(H,22,25)
Reactome pathway
US Patent
n/an/a 2n/an/an/an/an/an/a
Bristol-Myers Squibb Company
US Patent
Assay Description
TBD
US Patent US10202390 (2019)
BindingDB Entry DOI: 10.7270/Q28W3GDC