BDBM347102 US10202404, Compound A-6
SMILES: C[C@H]1CO[C@@H]2Cn3cc(-c4ncc(Cc5ccc(F)cc5F)s4)c(=O)c(O)c3C(=O)N12
InChI Key: InChIKey=DEZSOODUTDWXMX-MGPLVRAMSA-N
Data: 1 EC50
Activity Spreadsheet -- Enzyme Inhibition Constant Data from BindingDB
Found 1 hit for monomerid = 347102
Trg + Lig
Ki
nM
ΔG°
kcal/mole
IC50
nM
Kd
nM
EC50/IC50
nM
koff
s-1
kon
M-1s-1
pHTemp
°C
Gag-Pol polyprotein
(Human immunodeficiency virus type 1 group M subtyp...)
BDBM347102
(US10202404, Compound A-6)
Show SMILES C[C@H]1CO[C@@H]2Cn3cc(-c4ncc(Cc5ccc(F)cc5F)s4)c(=O)c(O)c3C(=O)N12 |r|
Show InChI InChI=1S/C21H17F2N3O4S/c1-10-9-30-16-8-25-7-14(18(27)19(28)17(25)21(29)26(10)16)20-24-6-13(31-20)4-11-2-3-12(22)5-15(11)23/h2-3,5-7,10,16,28H,4,8-9H2,1H3/t10-,16+/m0/s1
US Patent
n/an/an/an/a 1.90n/an/an/an/a
SHIONOGI & CO., LTD.
US Patent
Assay Description
Previously, a series of two-fold dilution on test samples were carried out in a 96-well plate (50 μL/well). Two plates were made for measuring a...
US Patent US10202404 (2019)
BindingDB Entry DOI: 10.7270/Q2WQ05WN