null
SMILES: C[C@H]1CO[C@@H]2Cn3cc(-c4ncc(Cc5c(F)cc(F)cc5F)s4)c(=O)c(O)c3C(=O)N12
InChI Key: InChIKey=DEERKAMOVCEYJQ-XXFAHNHDSA-N
Activity Spreadsheet -- Enzyme Inhibition Constant Data from BindingDB
Found 1 hit for monomerid = 347143
Trg + Lig
Ki
nM
ΔG°
kcal/mole
IC50
nM
Kd
nM
EC50/IC50
nM
koff
s-1
kon
M-1s-1
pHTemp
°C
Gag-Pol polyprotein
(Human immunodeficiency virus type 1 group M subtyp...)
BDBM347143
(US10202404, Compound A-14)
Show SMILES C[C@H]1CO[C@@H]2Cn3cc(-c4ncc(Cc5c(F)cc(F)cc5F)s4)c(=O)c(O)c3C(=O)N12 |r|
Show InChI InChI=1S/C21H16F3N3O4S/c1-9-8-31-16-7-26-6-13(18(28)19(29)17(26)21(30)27(9)16)20-25-5-11(32-20)4-12-14(23)2-10(22)3-15(12)24/h2-3,5-6,9,16,29H,4,7-8H2,1H3/t9-,16+/m0/s1
US Patent
n/an/an/an/a 1.20n/an/an/an/a
SHIONOGI & CO., LTD.
US Patent
Assay Description
Previously, a series of two-fold dilution on test samples were carried out in a 96-well plate (50 μL/well). Two plates were made for measuring a...
US Patent US10202404 (2019)
BindingDB Entry DOI: 10.7270/Q2WQ05WN