BDBM347144 US10202404, Compound A-15
SMILES: C[C@H]1CO[C@@H]2Cn3cc(-c4nnc(Cc5ccc(F)cc5F)s4)c(=O)c(O)c3C(=O)N12
InChI Key: InChIKey=YDHJMWPJQNYUPS-BJOHPYRUSA-N
Data: 1 EC50
Activity Spreadsheet -- Enzyme Inhibition Constant Data from BindingDB
Found 1 hit for monomerid = 347144
Trg + Lig
Ki
nM
ΔG°
kcal/mole
IC50
nM
Kd
nM
EC50/IC50
nM
koff
s-1
kon
M-1s-1
pHTemp
°C
Gag-Pol polyprotein
(Human immunodeficiency virus type 1 group M subtyp...)
BDBM347144
(US10202404, Compound A-15)
Show SMILES C[C@H]1CO[C@@H]2Cn3cc(-c4nnc(Cc5ccc(F)cc5F)s4)c(=O)c(O)c3C(=O)N12 |r|
Show InChI InChI=1S/C20H16F2N4O4S/c1-9-8-30-15-7-25-6-12(17(27)18(28)16(25)20(29)26(9)15)19-24-23-14(31-19)4-10-2-3-11(21)5-13(10)22/h2-3,5-6,9,15,28H,4,7-8H2,1H3/t9-,15+/m0/s1
US Patent
n/an/an/an/a 1.10n/an/an/an/a
SHIONOGI & CO., LTD.
US Patent
Assay Description
Previously, a series of two-fold dilution on test samples were carried out in a 96-well plate (50 μL/well). Two plates were made for measuring a...
US Patent US10202404 (2019)
BindingDB Entry DOI: 10.7270/Q2WQ05WN