BDBM347184 US10202404, Compound A-57
SMILES: C[C@H]1N2[C@H](Cn3cc(-c4nnc(Cc5ccc(F)cc5F)s4)c(=O)c(O)c3C2=O)OCC11CC1
InChI Key: InChIKey=GHBQZPUDUQZZSQ-DIFFPNOSSA-N
Data: 1 EC50
Activity Spreadsheet -- Enzyme Inhibition Constant Data from BindingDB
Found 1 hit for monomerid = 347184
Trg + Lig
Ki
nM
ΔG°
kcal/mole
IC50
nM
Kd
nM
EC50/IC50
nM
koff
s-1
kon
M-1s-1
pHTemp
°C
Gag-Pol polyprotein
(Human immunodeficiency virus type 1 group M subtyp...)
BDBM347184
(US10202404, Compound A-57)
Show SMILES C[C@H]1N2[C@H](Cn3cc(-c4nnc(Cc5ccc(F)cc5F)s4)c(=O)c(O)c3C2=O)OCC11CC1 |r|
Show InChI InChI=1S/C23H20F2N4O4S/c1-11-23(4-5-23)10-33-17-9-28-8-14(19(30)20(31)18(28)22(32)29(11)17)21-27-26-16(34-21)6-12-2-3-13(24)7-15(12)25/h2-3,7-8,11,17,31H,4-6,9-10H2,1H3/t11-,17+/m1/s1
US Patent
n/an/an/an/a 1.70n/an/an/an/a
SHIONOGI & CO., LTD.
US Patent
Assay Description
Previously, a series of two-fold dilution on test samples were carried out in a 96-well plate (50 μL/well). Two plates were made for measuring a...
US Patent US10202404 (2019)
BindingDB Entry DOI: 10.7270/Q2WQ05WN