null
SMILES: Oc1c2C(=O)N3C[C@H]4C[C@H]4[C@H]3Cn2cc(-c2nnc(Cc3ccc(F)cc3F)s2)c1=O
InChI Key: InChIKey=DVEOVAIICINBHM-IXPVHAAZSA-N
Activity Spreadsheet -- Enzyme Inhibition Constant Data from BindingDB
Found 1 hit for monomerid = 347216
Trg + Lig
Ki
nM
ΔG°
kcal/mole
IC50
nM
Kd
nM
EC50/IC50
nM
koff
s-1
kon
M-1s-1
pHTemp
°C
Gag-Pol polyprotein
(Human immunodeficiency virus type 1 group M subtyp...)
BDBM347216
(US10202404, Compound B-9)
Show SMILES Oc1c2C(=O)N3C[C@H]4C[C@H]4[C@H]3Cn2cc(-c2nnc(Cc3ccc(F)cc3F)s2)c1=O |r|
Show InChI InChI=1S/C21H16F2N4O3S/c22-11-2-1-9(14(23)5-11)4-16-24-25-20(31-16)13-7-26-8-15-12-3-10(12)6-27(15)21(30)17(26)19(29)18(13)28/h1-2,5,7,10,12,15,29H,3-4,6,8H2/t10-,12-,15-/m1/s1
US Patent
n/an/an/an/a 2n/an/an/an/a
SHIONOGI & CO., LTD.
US Patent
Assay Description
Previously, a series of two-fold dilution on test samples were carried out in a 96-well plate (50 μL/well). Two plates were made for measuring a...
US Patent US10202404 (2019)
BindingDB Entry DOI: 10.7270/Q2WQ05WN