null
SMILES: COCCN1CN(C)n2cc(-c3nnc(Cc4ccc(F)cc4F)s3)c(=O)c(O)c2C1=O
InChI Key: InChIKey=GVOBDMCNRCSJGP-UHFFFAOYSA-N
Activity Spreadsheet -- Enzyme Inhibition Constant Data from BindingDB
Found 1 hit for monomerid = 347231
Trg + Lig
Ki
nM
ΔG°
kcal/mole
IC50
nM
Kd
nM
EC50/IC50
nM
koff
s-1
kon
M-1s-1
pHTemp
°C
Gag-Pol polyprotein
(Human immunodeficiency virus type 1 group M subtyp...)
BDBM347231
(US10202404, Compound C-3)
Show SMILES COCCN1CN(C)n2cc(-c3nnc(Cc4ccc(F)cc4F)s3)c(=O)c(O)c2C1=O
Show InChI InChI=1S/C20H19F2N5O4S/c1-25-10-26(5-6-31-2)20(30)16-18(29)17(28)13(9-27(16)25)19-24-23-15(32-19)7-11-3-4-12(21)8-14(11)22/h3-4,8-9,29H,5-7,10H2,1-2H3
US Patent
n/an/an/an/a 1.10n/an/an/an/a
SHIONOGI & CO., LTD.
US Patent
Assay Description
Previously, a series of two-fold dilution on test samples were carried out in a 96-well plate (50 μL/well). Two plates were made for measuring a...
US Patent US10202404 (2019)
BindingDB Entry DOI: 10.7270/Q2WQ05WN