null
SMILES: CCN1CN(CCOC)C(=O)c2c(O)c(=O)c(cn12)-c1nnc(Cc2cccc(Cl)c2F)s1
InChI Key: InChIKey=NGCUOLOOTKOXEW-UHFFFAOYSA-N
Activity Spreadsheet -- Enzyme Inhibition Constant Data from BindingDB
Found 1 hit for monomerid = 347232
Trg + Lig
Ki
nM
ΔG°
kcal/mole
IC50
nM
Kd
nM
EC50/IC50
nM
koff
s-1
kon
M-1s-1
pHTemp
°C
Gag-Pol polyprotein
(Human immunodeficiency virus type 1 group M subtyp...)
BDBM347232
(US10202404, Compound C-4)
Show SMILES CCN1CN(CCOC)C(=O)c2c(O)c(=O)c(cn12)-c1nnc(Cc2cccc(Cl)c2F)s1
Show InChI InChI=1S/C21H21ClFN5O4S/c1-3-27-11-26(7-8-32-2)21(31)17-19(30)18(29)13(10-28(17)27)20-25-24-15(33-20)9-12-5-4-6-14(22)16(12)23/h4-6,10,30H,3,7-9,11H2,1-2H3
US Patent
n/an/an/an/a 2.10n/an/an/an/a
SHIONOGI & CO., LTD.
US Patent
Assay Description
Previously, a series of two-fold dilution on test samples were carried out in a 96-well plate (50 μL/well). Two plates were made for measuring a...
US Patent US10202404 (2019)
BindingDB Entry DOI: 10.7270/Q2WQ05WN