BDBM347239 US10202404, Compound C-13
SMILES: COCCN1CN(C)n2cc(-c3ncc(Cc4ccc(F)cc4F)s3)c(=O)c(O)c2C1=O
InChI Key: InChIKey=DJUOIYGKUYINFC-UHFFFAOYSA-N
Data: 1 EC50
Activity Spreadsheet -- Enzyme Inhibition Constant Data from BindingDB
Found 1 hit for monomerid = 347239
Trg + Lig
Ki
nM
ΔG°
kcal/mole
IC50
nM
Kd
nM
EC50/IC50
nM
koff
s-1
kon
M-1s-1
pHTemp
°C
Gag-Pol polyprotein
(Human immunodeficiency virus type 1 group M subtyp...)
BDBM347239
(US10202404, Compound C-13)
Show SMILES COCCN1CN(C)n2cc(-c3ncc(Cc4ccc(F)cc4F)s3)c(=O)c(O)c2C1=O
Show InChI InChI=1S/C21H20F2N4O4S/c1-25-11-26(5-6-31-2)21(30)17-19(29)18(28)15(10-27(17)25)20-24-9-14(32-20)7-12-3-4-13(22)8-16(12)23/h3-4,8-10,29H,5-7,11H2,1-2H3
US Patent
n/an/an/an/a 2.70n/an/an/an/a
SHIONOGI & CO., LTD.
US Patent
Assay Description
Previously, a series of two-fold dilution on test samples were carried out in a 96-well plate (50 μL/well). Two plates were made for measuring a...
US Patent US10202404 (2019)
BindingDB Entry DOI: 10.7270/Q2WQ05WN