BDBM347246 US10202404, Compound C-21
SMILES: CCN1Cn2cc(-c3nnc(Cc4ccc(F)cc4F)s3)c(=O)c(O)c2C(=O)N1CC
InChI Key: InChIKey=WESBWRLGYNWELW-UHFFFAOYSA-N
Data: 1 EC50
Activity Spreadsheet -- Enzyme Inhibition Constant Data from BindingDB
Found 1 hit for monomerid = 347246
Trg + Lig
Ki
nM
ΔG°
kcal/mole
IC50
nM
Kd
nM
EC50/IC50
nM
koff
s-1
kon
M-1s-1
pHTemp
°C
Gag-Pol polyprotein
(Human immunodeficiency virus type 1 group M subtyp...)
BDBM347246
(US10202404, Compound C-21)
Show SMILES CCN1Cn2cc(-c3nnc(Cc4ccc(F)cc4F)s3)c(=O)c(O)c2C(=O)N1CC
Show InChI InChI=1S/C20H19F2N5O3S/c1-3-26-10-25-9-13(17(28)18(29)16(25)20(30)27(26)4-2)19-24-23-15(31-19)7-11-5-6-12(21)8-14(11)22/h5-6,8-9,29H,3-4,7,10H2,1-2H3
US Patent
n/an/an/an/a 1.5n/an/an/an/a
SHIONOGI & CO., LTD.
US Patent
Assay Description
Previously, a series of two-fold dilution on test samples were carried out in a 96-well plate (50 μL/well). Two plates were made for measuring a...
US Patent US10202404 (2019)
BindingDB Entry DOI: 10.7270/Q2WQ05WN