null
SMILES: Cn1cc(cn1)-c1cccc(c1)-c1ncc(-c2cnn(C)c2)c(NC2CCOC2)n1
InChI Key: InChIKey=WMPBJANDRBQKLJ-UHFFFAOYSA-N
Activity Spreadsheet -- Enzyme Inhibition Constant Data from BindingDB
Found 2 hits for monomerid = 347835
Trg + Lig
Ki
nM
ΔG°
kcal/mole
IC50
nM
Kd
nM
EC50/IC50
nM
koff
s-1
kon
M-1s-1
pHTemp
°C
Interleukin-1 receptor-associated kinase 4
(Homo sapiens (Human))
BDBM347835
(US9790221, Compound 41)
Show SMILES Cn1cc(cn1)-c1cccc(c1)-c1ncc(-c2cnn(C)c2)c(NC2CCOC2)n1
Show InChI InChI=1S/C22H23N7O/c1-28-12-17(9-24-28)15-4-3-5-16(8-15)21-23-11-20(18-10-25-29(2)13-18)22(27-21)26-19-6-7-30-14-19/h3-5,8-13,19H,6-7,14H2,1-2H3,(H,23,26,27)
Reactome pathway
US Patent
n/an/a 550n/an/an/an/an/an/a
Merck Patent GmbH
US Patent
Assay Description
IRAK4 is a human purified recombinant enzyme (His-TEV-IRAK1 (194-712). IRAK4 hydrolyses ATP, autophosphorylates and phosphorylates a Serine/Threonine...
US Patent US9790221 (2017)
BindingDB Entry DOI: 10.7270/Q29S1T4F
Interleukin-1 receptor-associated kinase 1 [194-712]
(Homo sapiens (Human))
BDBM347835
(US9790221, Compound 41)
Show SMILES Cn1cc(cn1)-c1cccc(c1)-c1ncc(-c2cnn(C)c2)c(NC2CCOC2)n1
Show InChI InChI=1S/C22H23N7O/c1-28-12-17(9-24-28)15-4-3-5-16(8-15)21-23-11-20(18-10-25-29(2)13-18)22(27-21)26-19-6-7-30-14-19/h3-5,8-13,19H,6-7,14H2,1-2H3,(H,23,26,27)
US Patent
n/an/a 550n/an/an/an/an/an/a
Merck Patent GmbH
US Patent
Assay Description
IRAK1 is a human purified recombinant enzyme (His-TEV-IRAK1 (194-712)). In this assay, IRAK-1 hydrolyses ATP and autophosphorylates. Measurement of I...
US Patent US9790221 (2017)
BindingDB Entry DOI: 10.7270/Q29S1T4F