null
SMILES: Cn1cc(cn1)-c1cccc(c1)-c1ncc(-c2cnn(C)c2)c(N[C@H]2CC[C@@H](CC2)NS(C)(=O)=O)n1
InChI Key: InChIKey=XSLLIHGJXBVYOG-HZCBDIJESA-N
Activity Spreadsheet -- Enzyme Inhibition Constant Data from BindingDB
Found 2 hits for monomerid = 347976
Trg + Lig
Ki
nM
ΔG°
kcal/mole
IC50
nM
Kd
nM
EC50/IC50
nM
koff
s-1
kon
M-1s-1
pHTemp
°C
Interleukin-1 receptor-associated kinase 4
(Homo sapiens (Human))
BDBM347976
(US9790221, Compound 182)
Show SMILES Cn1cc(cn1)-c1cccc(c1)-c1ncc(-c2cnn(C)c2)c(N[C@H]2CC[C@@H](CC2)NS(C)(=O)=O)n1 |r,wU:27.33,wD:24.26,(1.86,5.84,;.37,6.23,;-.54,4.99,;-2,5.46,;-2,7,;-.54,7.48,;-3.33,4.69,;-4.67,5.46,;-6,4.69,;-6,3.15,;-4.67,2.38,;-3.33,3.15,;-4.67,.84,;-6,.07,;-6,-1.47,;-4.67,-2.24,;-4.67,-3.78,;-5.91,-4.68,;-5.44,-6.15,;-3.9,-6.15,;-3.13,-7.48,;-3.42,-4.68,;-3.33,-1.47,;-2,-2.24,;-.67,-1.47,;.67,-2.24,;2,-1.47,;2,.07,;.67,.84,;-.67,.07,;3.33,.84,;4.67,.07,;6,.84,;3.9,-1.26,;5.44,-1.26,;-3.33,.07,)|
Show InChI InChI=1S/C25H30N8O2S/c1-32-15-19(12-27-32)17-5-4-6-18(11-17)24-26-14-23(20-13-28-33(2)16-20)25(30-24)29-21-7-9-22(10-8-21)31-36(3,34)35/h4-6,11-16,21-22,31H,7-10H2,1-3H3,(H,26,29,30)/t21-,22-
Reactome pathway
US Patent
n/an/a<100n/an/an/an/an/an/a
Merck Patent GmbH
US Patent
Assay Description
IRAK4 is a human purified recombinant enzyme (His-TEV-IRAK1 (194-712). IRAK4 hydrolyses ATP, autophosphorylates and phosphorylates a Serine/Threonine...
US Patent US9790221 (2017)
BindingDB Entry DOI: 10.7270/Q29S1T4F
Interleukin-1 receptor-associated kinase 1 [194-712]
(Homo sapiens (Human))
BDBM347976
(US9790221, Compound 182)
Show SMILES Cn1cc(cn1)-c1cccc(c1)-c1ncc(-c2cnn(C)c2)c(N[C@H]2CC[C@@H](CC2)NS(C)(=O)=O)n1 |r,wU:27.33,wD:24.26,(1.86,5.84,;.37,6.23,;-.54,4.99,;-2,5.46,;-2,7,;-.54,7.48,;-3.33,4.69,;-4.67,5.46,;-6,4.69,;-6,3.15,;-4.67,2.38,;-3.33,3.15,;-4.67,.84,;-6,.07,;-6,-1.47,;-4.67,-2.24,;-4.67,-3.78,;-5.91,-4.68,;-5.44,-6.15,;-3.9,-6.15,;-3.13,-7.48,;-3.42,-4.68,;-3.33,-1.47,;-2,-2.24,;-.67,-1.47,;.67,-2.24,;2,-1.47,;2,.07,;.67,.84,;-.67,.07,;3.33,.84,;4.67,.07,;6,.84,;3.9,-1.26,;5.44,-1.26,;-3.33,.07,)|
Show InChI InChI=1S/C25H30N8O2S/c1-32-15-19(12-27-32)17-5-4-6-18(11-17)24-26-14-23(20-13-28-33(2)16-20)25(30-24)29-21-7-9-22(10-8-21)31-36(3,34)35/h4-6,11-16,21-22,31H,7-10H2,1-3H3,(H,26,29,30)/t21-,22-
US Patent
n/an/a<100n/an/an/an/an/an/a
Merck Patent GmbH
US Patent
Assay Description
IRAK1 is a human purified recombinant enzyme (His-TEV-IRAK1 (194-712)). In this assay, IRAK-1 hydrolyses ATP and autophosphorylates. Measurement of I...
US Patent US9790221 (2017)
BindingDB Entry DOI: 10.7270/Q29S1T4F