null
SMILES: CN(C)c1nc2ccccc2cc1Cn1nc(-c2ccc3nc(NC(C)=O)sc3c2)c2c(N)ncnc12
InChI Key: InChIKey=MJBKGYFNEBPOAX-UHFFFAOYSA-N
Activity Spreadsheet -- Enzyme Inhibition Constant Data from BindingDB
Found 4 hits for monomerid = 348211
Trg + Lig
Ki
nM
ΔG°
kcal/mole
IC50
nM
Kd
nM
EC50/IC50
nM
koff
s-1
kon
M-1s-1
pHTemp
°C
Phosphatidylinositol 4,5-bisphosphate 3-kinase catalytic subunit delta isoform
(Homo sapiens (Human))
BDBM348211
(US9790228, Compound 130)
Show SMILES CN(C)c1nc2ccccc2cc1Cn1nc(-c2ccc3nc(NC(C)=O)sc3c2)c2c(N)ncnc12
Show InChI InChI=1S/C26H23N9OS/c1-14(36)30-26-32-19-9-8-16(11-20(19)37-26)22-21-23(27)28-13-29-25(21)35(33-22)12-17-10-15-6-4-5-7-18(15)31-24(17)34(2)3/h4-11,13H,12H2,1-3H3,(H2,27,28,29)(H,30,32,36)
NCI pathway
Reactome pathway
US Patent
n/an/a<100n/an/an/an/an/an/a
Intellikine LLC
US Patent
Assay Description
Class I PI3-Ks can be either purchased (p110α/p85α, p110β/p85α, p110δ/p85α from Upstate, and p110γ from Sigma) or ...
US Patent US9790228 (2017)
BindingDB Entry DOI: 10.7270/Q26112FV
Phosphatidylinositol 4-phosphate 3-kinase C2 domain-containing subunit beta
(Homo sapiens (Human))
BDBM348211
(US9790228, Compound 130)
Show SMILES CN(C)c1nc2ccccc2cc1Cn1nc(-c2ccc3nc(NC(C)=O)sc3c2)c2c(N)ncnc12
Show InChI InChI=1S/C26H23N9OS/c1-14(36)30-26-32-19-9-8-16(11-20(19)37-26)22-21-23(27)28-13-29-25(21)35(33-22)12-17-10-15-6-4-5-7-18(15)31-24(17)34(2)3/h4-11,13H,12H2,1-3H3,(H2,27,28,29)(H,30,32,36)
NCI pathway
Reactome pathway
US Patent
n/an/a<100n/an/an/an/an/an/a
Intellikine LLC
US Patent
Assay Description
Class I PI3-Ks can be either purchased (p110α/p85α, p110β/p85α, p110δ/p85α from Upstate, and p110γ from Sigma) or ...
US Patent US9790228 (2017)
BindingDB Entry DOI: 10.7270/Q26112FV
Phosphatidylinositol 3-kinase regulatory subunit alpha
(Homo sapiens (Human))
BDBM348211
(US9790228, Compound 130)
Show SMILES CN(C)c1nc2ccccc2cc1Cn1nc(-c2ccc3nc(NC(C)=O)sc3c2)c2c(N)ncnc12
Show InChI InChI=1S/C26H23N9OS/c1-14(36)30-26-32-19-9-8-16(11-20(19)37-26)22-21-23(27)28-13-29-25(21)35(33-22)12-17-10-15-6-4-5-7-18(15)31-24(17)34(2)3/h4-11,13H,12H2,1-3H3,(H2,27,28,29)(H,30,32,36)
US Patent
n/an/a<100n/an/an/an/an/an/a
Intellikine LLC
US Patent
Assay Description
Class I PI3-Ks can be either purchased (p110α/p85α, p110β/p85α, p110δ/p85α from Upstate, and p110γ from Sigma) or ...
US Patent US9790228 (2017)
BindingDB Entry DOI: 10.7270/Q26112FV
Phosphatidylinositol 4,5-bisphosphate 3-kinase catalytic subunit gamma isoform
(Homo sapiens (Human))
BDBM348211
(US9790228, Compound 130)
Show SMILES CN(C)c1nc2ccccc2cc1Cn1nc(-c2ccc3nc(NC(C)=O)sc3c2)c2c(N)ncnc12
Show InChI InChI=1S/C26H23N9OS/c1-14(36)30-26-32-19-9-8-16(11-20(19)37-26)22-21-23(27)28-13-29-25(21)35(33-22)12-17-10-15-6-4-5-7-18(15)31-24(17)34(2)3/h4-11,13H,12H2,1-3H3,(H2,27,28,29)(H,30,32,36)
NCI pathway
Reactome pathway
US Patent
n/an/a<100n/an/an/an/an/an/a
Intellikine LLC
US Patent
Assay Description
Class I PI3-Ks can be either purchased (p110α/p85α, p110β/p85α, p110δ/p85α from Upstate, and p110γ from Sigma) or ...
US Patent US9790228 (2017)
BindingDB Entry DOI: 10.7270/Q26112FV